https://github.com/SpringSource/spring-xd

Build: #2261 failed

Job: Default Job failed

Stages & jobs

  1. Default Stage

Job result summary

Completed
Duration
192 minutes
Revision
39c6a274b55d36b81b5ab3d12de9f7e245fd243f 39c6a274b55d36b81b5ab3d12de9f7e245fd243f
Total tests
732
Number of retries
1

Tests

  • 732 tests in total
  • 17 tests failed
  • 17 failures are new
  • 5 tests were quarantined / skipped
  • 94 minutes taken in total.
New test failures 17
Status Test Duration
Collapse Failed KafkaMessageBusTests createInboundPubSubBeforeOutboundPubSub History
9 secs
java.lang.AssertionError: java.lang.AssertionError
java.lang.AssertionError
	at org.junit.Assert.fail(Assert.java:86)
	at org.junit.Assert.assertTrue(Assert.java:41)
	at org.junit.Assert.assertNotNull(Assert.java:712)
	at org.junit.Assert.assertNotNull(Assert.java:722)
	at org.springframework.xd.dirt.integration.bus.AbstractMessageBusTests.createInboundPubSubBeforeOutboundPubSub(AbstractMessageBusTests.java:217)
	at sun.reflect.NativeMethodAccessorImpl.invoke0(Native Method)
(42 more lines...)
Collapse Failed KafkaMessageBusTests testPartitionedModuleSpEL History
5 secs
java.lang.AssertionError: java.lang.AssertionError
java.lang.AssertionError
	at org.junit.Assert.fail(Assert.java:86)
	at org.junit.Assert.assertTrue(Assert.java:41)
	at org.junit.Assert.assertNotNull(Assert.java:712)
	at org.junit.Assert.assertNotNull(Assert.java:722)
	at org.springframework.xd.dirt.integration.bus.PartitionCapableBusTests.testPartitionedModuleSpEL(PartitionCapableBusTests.java:133)
	at sun.reflect.NativeMethodAccessorImpl.invoke0(Native Method)
(42 more lines...)
Collapse Failed RawModeKafkaMessageBusTests createInboundPubSubBeforeOutboundPubSub History
4 secs
org.junit.ComparisonFailure: org.junit.ComparisonFailure: expected:<[foo]> but was:<[�??contentType????"text/plain"?originalContentType???	"foo/bar"bar]>
org.junit.ComparisonFailure: expected:<[foo]> but was:<[�??contentType????"text/plain"?originalContentType???	"foo/bar"bar]>
	at org.junit.Assert.assertEquals(Assert.java:115)
	at org.junit.Assert.assertEquals(Assert.java:144)
	at org.springframework.xd.dirt.integration.bus.kafka.RawModeKafkaMessageBusTests.createInboundPubSubBeforeOutboundPubSub(RawModeKafkaMessageBusTests.java:213)
	at sun.reflect.NativeMethodAccessorImpl.invoke0(Native Method)
	at sun.reflect.NativeMethodAccessorImpl.invoke(NativeMethodAccessorImpl.java:57)
	at sun.reflect.DelegatingMethodAccessorImpl.invoke(DelegatingMethodAccessorImpl.java:43)
(40 more lines...)
Collapse Failed RawModeKafkaMessageBusTests testCustomPartitionCountOverridesModuleCountAndConcurrencyIfLarger History
7 secs
java.lang.AssertionError: java.lang.AssertionError
java.lang.AssertionError
	at org.junit.Assert.fail(Assert.java:86)
	at org.junit.Assert.assertTrue(Assert.java:41)
	at org.junit.Assert.assertNotNull(Assert.java:712)
	at org.junit.Assert.assertNotNull(Assert.java:722)
	at org.springframework.xd.dirt.integration.bus.kafka.KafkaMessageBusTests.testCustomPartitionCountOverridesModuleCountAndConcurrencyIfLarger(KafkaMessageBusTests.java:245)
	at sun.reflect.NativeMethodAccessorImpl.invoke0(Native Method)
(42 more lines...)
Collapse Failed RawModeKafkaMessageBusTests testPartitionedModuleJava History
7 secs
java.lang.AssertionError: java.lang.AssertionError
java.lang.AssertionError
	at org.junit.Assert.fail(Assert.java:86)
	at org.junit.Assert.assertTrue(Assert.java:41)
	at org.junit.Assert.assertNotNull(Assert.java:712)
	at org.junit.Assert.assertNotNull(Assert.java:722)
	at org.springframework.xd.dirt.integration.bus.kafka.RawModeKafkaMessageBusTests.testPartitionedModuleJava(RawModeKafkaMessageBusTests.java:99)
	at sun.reflect.NativeMethodAccessorImpl.invoke0(Native Method)
(42 more lines...)
Collapse Failed RawModeKafkaMessageBusTests testPartitionedModuleSpEL History
6 secs
java.lang.AssertionError: java.lang.AssertionError
java.lang.AssertionError
	at org.junit.Assert.fail(Assert.java:86)
	at org.junit.Assert.assertTrue(Assert.java:41)
	at org.junit.Assert.assertNotNull(Assert.java:712)
	at org.junit.Assert.assertNotNull(Assert.java:722)
	at org.springframework.xd.dirt.integration.bus.kafka.RawModeKafkaMessageBusTests.testPartitionedModuleSpEL(RawModeKafkaMessageBusTests.java:166)
	at sun.reflect.NativeMethodAccessorImpl.invoke0(Native Method)
(42 more lines...)
Collapse Failed RawModeKafkaMessageBusTests testSendAndReceivePubSub History
15 secs
java.lang.AssertionError: java.lang.AssertionError: expected null, but was:<GenericMessage [payload=byte[3], headers={kafka_nextOffset=1435, kafka_offset=1434, kafka_messageKey=null, kafka_partitionId=0, kafka_topic=tap_3Abaz.http}]>
java.lang.AssertionError: expected null, but was:<GenericMessage [payload=byte[3], headers={kafka_nextOffset=1435, kafka_offset=1434, kafka_messageKey=null, kafka_partitionId=0, kafka_topic=tap_3Abaz.http}]>
	at org.junit.Assert.fail(Assert.java:88)
	at org.junit.Assert.failNotNull(Assert.java:755)
	at org.junit.Assert.assertNull(Assert.java:737)
	at org.junit.Assert.assertNull(Assert.java:747)
	at org.springframework.xd.dirt.integration.bus.kafka.RawModeKafkaMessageBusTests.testSendAndReceivePubSub(RawModeKafkaMessageBusTests.java:325)
	at sun.reflect.NativeMethodAccessorImpl.invoke0(Native Method)
(42 more lines...)
Collapse Failed FileSourceModuleTests testLinesModeWithMarkersTrue History
< 1 sec
org.springframework.beans.factory.xml.XmlBeanDefinitionStoreException: org.springframework.beans.factory.xml.XmlBeanDefinitionStoreException: Line 7 in XML document from file [/data/bamboo-home/xml-data/build-dir/XD-MASTER-JOB1/spring-xd-dirt/build/resources/test/testmodules/sink/sink/config/sink.xml] is invalid; nested exception is org.xml.sax.SAXParseException; lineNumber: 7; columnNumber: 78; cvc-elt.1: Cannot find the declaration of element 'beans:beans'.
org.springframework.beans.factory.xml.XmlBeanDefinitionStoreException: Line 7 in XML document from file [/data/bamboo-home/xml-data/build-dir/XD-MASTER-JOB1/spring-xd-dirt/build/resources/test/testmodules/sink/sink/config/sink.xml] is invalid; nested exception is org.xml.sax.SAXParseException; lineNumber: 7; columnNumber: 78; cvc-elt.1: Cannot find the declaration of element 'beans:beans'.
	at org.springframework.beans.factory.xml.XmlBeanDefinitionReader.doLoadBeanDefinitions(XmlBeanDefinitionReader.java:399)
	at org.springframework.beans.factory.xml.XmlBeanDefinitionReader.loadBeanDefinitions(XmlBeanDefinitionReader.java:336)
	at org.springframework.beans.factory.xml.XmlBeanDefinitionReader.loadBeanDefinitions(XmlBeanDefinitionReader.java:304)
	at org.springframework.xd.module.options.DefaultModuleOptionsMetadataResolver.inferModuleOptionsMetadata(DefaultModuleOptionsMetadataResolver.java:257)
	at org.springframework.xd.module.options.DefaultModuleOptionsMetadataResolver.resolveNormalMetadata(DefaultModuleOptionsMetadataResolver.java:198)
	at org.springframework.xd.module.options.DefaultModuleOptionsMetadataResolver.resolve(DefaultModuleOptionsMetadataResolver.java:172)
(76 more lines...)
Collapse Failed KafkaSingleNodeStreamDeploymentIntegrationTests testBasicTap History
25 secs
java.lang.AssertionError: java.lang.AssertionError: expected:<DRACARYS!> but was:<null>
java.lang.AssertionError: expected:<DRACARYS!> but was:<null>
	at org.junit.Assert.fail(Assert.java:88)
	at org.junit.Assert.failNotEquals(Assert.java:834)
	at org.junit.Assert.assertEquals(Assert.java:118)
	at org.junit.Assert.assertEquals(Assert.java:144)
	at org.springframework.xd.dirt.stream.AbstractSingleNodeStreamDeploymentIntegrationTests.tapTest(AbstractSingleNodeStreamDeploymentIntegrationTests.java:609)
	at org.springframework.xd.dirt.stream.AbstractSingleNodeStreamDeploymentIntegrationTests.testBasicTap(AbstractSingleNodeStreamDeploymentIntegrationTests.java:273)
(47 more lines...)
Collapse Failed KafkaSingleNodeStreamDeploymentIntegrationTests testTappingWithLabels History
30 secs
java.lang.AssertionError: java.lang.AssertionError: expected:<DR.C.RYS!> but was:<null>
java.lang.AssertionError: expected:<DR.C.RYS!> but was:<null>
	at org.junit.Assert.fail(Assert.java:88)
	at org.junit.Assert.failNotEquals(Assert.java:834)
	at org.junit.Assert.assertEquals(Assert.java:118)
	at org.junit.Assert.assertEquals(Assert.java:144)
	at org.springframework.xd.dirt.stream.AbstractSingleNodeStreamDeploymentIntegrationTests.tapTest(AbstractSingleNodeStreamDeploymentIntegrationTests.java:612)
	at org.springframework.xd.dirt.stream.AbstractSingleNodeStreamDeploymentIntegrationTests.testTappingWithLabels(AbstractSingleNodeStreamDeploymentIntegrationTests.java:286)
(47 more lines...)
Collapse Failed KafkaSingleNodeStreamDeploymentIntegrationTests testTopicChannel History
40 secs
java.lang.AssertionError: java.lang.AssertionError
java.lang.AssertionError
	at org.junit.Assert.fail(Assert.java:86)
	at org.junit.Assert.assertTrue(Assert.java:41)
	at org.junit.Assert.assertNotNull(Assert.java:712)
	at org.junit.Assert.assertNotNull(Assert.java:722)
	at org.springframework.xd.dirt.stream.AbstractSingleNodeStreamDeploymentIntegrationTests.testTopicChannel(AbstractSingleNodeStreamDeploymentIntegrationTests.java:337)
	at sun.reflect.NativeMethodAccessorImpl.invoke0(Native Method)
(46 more lines...)
Collapse Failed KafkaSingleNodeStreamDeploymentIntegrationTests verifyTopicChannelsRegisteredOnDemand History
13 secs
org.springframework.beans.factory.NoSuchBeanDefinitionException: org.springframework.beans.factory.NoSuchBeanDefinitionException: No bean named 'topic:y' is defined
org.springframework.beans.factory.NoSuchBeanDefinitionException: No bean named 'topic:y' is defined
	at org.springframework.beans.factory.support.DefaultListableBeanFactory.getBeanDefinition(DefaultListableBeanFactory.java:687)
	at org.springframework.beans.factory.support.AbstractBeanFactory.getMergedLocalBeanDefinition(AbstractBeanFactory.java:1168)
	at org.springframework.beans.factory.support.AbstractBeanFactory.doGetBean(AbstractBeanFactory.java:281)
	at org.springframework.beans.factory.support.AbstractBeanFactory.getBean(AbstractBeanFactory.java:199)
	at org.springframework.beans.factory.support.AbstractBeanFactory.doGetBean(AbstractBeanFactory.java:272)
	at org.springframework.beans.factory.support.AbstractBeanFactory.getBean(AbstractBeanFactory.java:199)
(51 more lines...)
Collapse Failed RabbitSingleNodeStreamDeploymentIntegrationTests moduleChannelsRegisteredWithMessageBus History
20 secs
java.lang.AssertionError: java.lang.AssertionError: expected:<2> but was:<1>
java.lang.AssertionError: expected:<2> but was:<1>
	at org.junit.Assert.fail(Assert.java:88)
	at org.junit.Assert.failNotEquals(Assert.java:834)
	at org.junit.Assert.assertEquals(Assert.java:645)
	at org.junit.Assert.assertEquals(Assert.java:631)
	at org.springframework.xd.dirt.stream.AbstractSingleNodeStreamDeploymentIntegrationTests.moduleChannelsRegisteredWithMessageBus(AbstractSingleNodeStreamDeploymentIntegrationTests.java:391)
	at sun.reflect.NativeMethodAccessorImpl.invoke0(Native Method)
(47 more lines...)
Collapse Failed RabbitSingleNodeStreamDeploymentIntegrationTests mqttSourceStreamReceivesMqttSinkStreamOutput History
26 secs
java.lang.AssertionError: java.lang.AssertionError: expected:<hello> but was:<null>
java.lang.AssertionError: expected:<hello> but was:<null>
	at org.junit.Assert.fail(Assert.java:88)
	at org.junit.Assert.failNotEquals(Assert.java:834)
	at org.junit.Assert.assertEquals(Assert.java:118)
	at org.junit.Assert.assertEquals(Assert.java:144)
	at org.springframework.xd.dirt.stream.RabbitSingleNodeStreamDeploymentIntegrationTests.mqttSourceStreamReceivesMqttSinkStreamOutput(RabbitSingleNodeStreamDeploymentIntegrationTests.java:87)
	at sun.reflect.NativeMethodAccessorImpl.invoke0(Native Method)
(47 more lines...)
Collapse Failed RabbitSingleNodeStreamDeploymentIntegrationTests mqttSourceStreamReceivesMqttSinkStreamOutputBinary History
28 secs
java.lang.AssertionError: java.lang.AssertionError: 
Expected: an instance of [B
     but: null
java.lang.AssertionError: 
Expected: an instance of [B
     but: null
	at org.springframework.test.util.MatcherAssertionErrors.assertThat(MatcherAssertionErrors.java:80)
	at org.springframework.test.util.MatcherAssertionErrors.assertThat(MatcherAssertionErrors.java:53)
(49 more lines...)
Collapse Failed RabbitSingleNodeStreamDeploymentIntegrationTests testRoutingWithSpel History
1 sec
org.springframework.xd.dirt.server.admin.deployment.DeploymentException: org.springframework.xd.dirt.server.admin.deployment.DeploymentException: routerDefinition
org.springframework.xd.dirt.server.admin.deployment.DeploymentException: routerDefinition
	at org.springframework.xd.dirt.stream.AbstractInstancePersistingDeployer.deployResource(AbstractInstancePersistingDeployer.java:134)
	at org.springframework.xd.dirt.stream.AbstractInstancePersistingDeployer.deploy(AbstractInstancePersistingDeployer.java:84)
	at org.springframework.xd.dirt.test.SingleNodeIntegrationTestSupport.waitForDeploy(SingleNodeIntegrationTestSupport.java:296)
	at org.springframework.xd.dirt.test.SingleNodeIntegrationTestSupport.waitForDeploy(SingleNodeIntegrationTestSupport.java:292)
	at org.springframework.xd.dirt.test.SingleNodeIntegrationTestSupport.deployStream(SingleNodeIntegrationTestSupport.java:157)
	at org.springframework.xd.dirt.stream.AbstractSingleNodeStreamDeploymentIntegrationTests.doTest(AbstractSingleNodeStreamDeploymentIntegrationTests.java:625)
(71 more lines...)
Collapse Failed RabbitSingleNodeStreamDeploymentIntegrationTests verifyTopicChannelsRegisteredOnDemand History
1 sec
org.springframework.xd.dirt.server.admin.deployment.DeploymentException: org.springframework.xd.dirt.server.admin.deployment.DeploymentException: routerDefinition
org.springframework.xd.dirt.server.admin.deployment.DeploymentException: routerDefinition
	at org.springframework.xd.dirt.stream.AbstractInstancePersistingDeployer.deployResource(AbstractInstancePersistingDeployer.java:134)
	at org.springframework.xd.dirt.stream.AbstractInstancePersistingDeployer.deploy(AbstractInstancePersistingDeployer.java:84)
	at org.springframework.xd.dirt.test.SingleNodeIntegrationTestSupport.waitForDeploy(SingleNodeIntegrationTestSupport.java:296)
	at org.springframework.xd.dirt.test.SingleNodeIntegrationTestSupport.deployStream(SingleNodeIntegrationTestSupport.java:167)
	at org.springframework.xd.dirt.stream.AbstractSingleNodeStreamDeploymentIntegrationTests.verifyTopicChannelsRegisteredOnDemand(AbstractSingleNodeStreamDeploymentIntegrationTests.java:525)
	at sun.reflect.NativeMethodAccessorImpl.invoke0(Native Method)
(56 more lines...)