Build: #8 failed

Job: Build and install XD failed

Stages & jobs

  1. Default Stage

Build log

The build generated 569,220 lines of output.The output is too long and has been truncated to the last 1,000 lines. Download or view full build log

22-Mar-2017 19:46:06 19:46:06.609 [DEBUG] [org.gradle.api.internal.artifacts.ivyservice.resolveengine.graph.DependencyGraphBuilder] Visiting dependency org.apache.hadoop:hadoop-yarn-server-nodemanager:2.7.1(runtime) -> commons-logging:commons-logging:1.1.3(dependency: commons-logging#commons-logging;1.1.3 {compile=[compile(*), master(*)], runtime=[runtime(*)]})
22-Mar-2017 19:46:06 19:46:06.609 [DEBUG] [org.gradle.api.internal.artifacts.ivyservice.resolveengine.graph.DependencyGraphBuilder] Visiting dependency org.apache.hadoop:hadoop-yarn-server-nodemanager:2.7.1(runtime) -> org.apache.hadoop:hadoop-annotations:2.7.1(dependency: org.apache.hadoop#hadoop-annotations;2.7.1 {compile=[compile(*), master(*)], runtime=[runtime(*)]})
22-Mar-2017 19:46:06 19:46:06.609 [DEBUG] [org.gradle.api.internal.artifacts.ivyservice.resolveengine.graph.DependencyGraphBuilder] Visiting dependency org.apache.hadoop:hadoop-yarn-server-nodemanager:2.7.1(runtime) -> com.google.inject.extensions:guice-servlet:3.0(dependency: com.google.inject.extensions#guice-servlet;3.0 {compile=[compile(*), master(*)], runtime=[runtime(*)]})
22-Mar-2017 19:46:06 19:46:06.609 [DEBUG] [org.gradle.api.internal.artifacts.ivyservice.resolveengine.graph.DependencyGraphBuilder] Visiting dependency org.apache.hadoop:hadoop-yarn-server-nodemanager:2.7.1(runtime) -> com.google.protobuf:protobuf-java:2.5.0(dependency: com.google.protobuf#protobuf-java;2.5.0 {compile=[compile(*), master(*)], runtime=[runtime(*)]})
22-Mar-2017 19:46:06 19:46:06.609 [DEBUG] [org.gradle.api.internal.artifacts.ivyservice.resolveengine.graph.DependencyGraphBuilder] Visiting dependency org.apache.hadoop:hadoop-yarn-server-nodemanager:2.7.1(runtime) -> com.google.inject:guice:3.0(dependency: com.google.inject#guice;3.0 {compile=[compile(*), master(*)], runtime=[runtime(*)]})
22-Mar-2017 19:46:06 19:46:06.609 [DEBUG] [org.gradle.api.internal.artifacts.ivyservice.resolveengine.graph.DependencyGraphBuilder] Visiting dependency org.apache.hadoop:hadoop-yarn-server-nodemanager:2.7.1(runtime) -> com.sun.jersey:jersey-json:1.9(dependency: com.sun.jersey#jersey-json;1.9 {compile=[compile(*), master(*)], runtime=[runtime(*)]})
22-Mar-2017 19:46:06 19:46:06.609 [DEBUG] [org.gradle.api.internal.artifacts.ivyservice.resolveengine.graph.DependencyGraphBuilder] Visiting dependency org.apache.hadoop:hadoop-yarn-server-nodemanager:2.7.1(runtime) -> com.sun.jersey.contribs:jersey-guice:1.9(dependency: com.sun.jersey.contribs#jersey-guice;1.9 {compile=[compile(*), master(*)], runtime=[runtime(*)]})
22-Mar-2017 19:46:06 19:46:06.609 [DEBUG] [org.gradle.api.internal.artifacts.ivyservice.resolveengine.graph.DependencyGraphBuilder] Visiting dependency org.apache.hadoop:hadoop-yarn-server-nodemanager:2.7.1(runtime) -> org.apache.hadoop:hadoop-yarn-server-common:2.7.1(dependency: org.apache.hadoop#hadoop-yarn-server-common;2.7.1 {compile=[compile(*), master(*)], runtime=[runtime(*)]})
22-Mar-2017 19:46:06 19:46:06.609 [DEBUG] [org.gradle.api.internal.artifacts.ivyservice.resolveengine.graph.DependencyGraphBuilder] Visiting dependency org.apache.hadoop:hadoop-yarn-server-nodemanager:2.7.1(runtime) -> org.fusesource.leveldbjni:leveldbjni-all:1.8(dependency: org.fusesource.leveldbjni#leveldbjni-all;1.8 {compile=[compile(*), master(*)], runtime=[runtime(*)]})
22-Mar-2017 19:46:06 19:46:06.609 [DEBUG] [org.gradle.api.internal.artifacts.ivyservice.resolveengine.graph.DependencyGraphBuilder] Visiting configuration org.apache.hadoop:hadoop-mapreduce-client-common:2.7.1(runtime).
22-Mar-2017 19:46:06 19:46:06.609 [DEBUG] [org.gradle.api.internal.artifacts.ivyservice.resolveengine.graph.DependencyGraphBuilder] Changed edges for org.apache.hadoop:hadoop-mapreduce-client-common:2.7.1(runtime) selects same versions as previous traversal. ignoring
22-Mar-2017 19:46:06 19:46:06.609 [DEBUG] [org.gradle.api.internal.artifacts.ivyservice.resolveengine.graph.DependencyGraphBuilder] Visiting configuration org.fusesource.leveldbjni:leveldbjni-all:1.8(runtime).
22-Mar-2017 19:46:06 19:46:06.609 [DEBUG] [org.gradle.api.internal.artifacts.ivyservice.resolveengine.graph.DependencyGraphBuilder] Changed edges for org.fusesource.leveldbjni:leveldbjni-all:1.8(runtime) selects same versions as previous traversal. ignoring
22-Mar-2017 19:46:06 19:46:06.609 [DEBUG] [org.gradle.api.internal.artifacts.ivyservice.resolveengine.graph.DependencyGraphBuilder] Visiting configuration org.apache.hadoop:hadoop-yarn-api:2.7.1(compile).
22-Mar-2017 19:46:06 19:46:06.609 [DEBUG] [org.gradle.api.internal.artifacts.ivyservice.resolveengine.graph.DependencyGraphBuilder] Changed edges for org.apache.hadoop:hadoop-yarn-api:2.7.1(compile) selects same versions as previous traversal. ignoring
22-Mar-2017 19:46:06 19:46:06.609 [DEBUG] [org.gradle.api.internal.artifacts.ivyservice.resolveengine.graph.DependencyGraphBuilder] Visiting configuration org.apache.hadoop:hadoop-yarn-api:2.7.1(master).
22-Mar-2017 19:46:06 19:46:06.609 [DEBUG] [org.gradle.api.internal.artifacts.ivyservice.resolveengine.graph.DependencyGraphBuilder] Changed edges for org.apache.hadoop:hadoop-yarn-api:2.7.1(master) selects same versions as previous traversal. ignoring
22-Mar-2017 19:46:06 19:46:06.609 [DEBUG] [org.gradle.api.internal.artifacts.ivyservice.resolveengine.graph.DependencyGraphBuilder] Visiting configuration org.apache.hadoop:hadoop-yarn-common:2.7.1(compile).
22-Mar-2017 19:46:06 19:46:06.609 [DEBUG] [org.gradle.api.internal.artifacts.ivyservice.resolveengine.graph.DependencyGraphBuilder] Changed edges for org.apache.hadoop:hadoop-yarn-common:2.7.1(compile) selects same versions as previous traversal. ignoring
22-Mar-2017 19:46:06 19:46:06.610 [DEBUG] [org.gradle.api.internal.artifacts.ivyservice.resolveengine.graph.DependencyGraphBuilder] Visiting configuration org.apache.hadoop:hadoop-yarn-common:2.7.1(master).
22-Mar-2017 19:46:06 19:46:06.610 [DEBUG] [org.gradle.api.internal.artifacts.ivyservice.resolveengine.graph.DependencyGraphBuilder] Changed edges for org.apache.hadoop:hadoop-yarn-common:2.7.1(master) selects same versions as previous traversal. ignoring
22-Mar-2017 19:46:06 19:46:06.610 [DEBUG] [org.gradle.api.internal.artifacts.ivyservice.resolveengine.graph.DependencyGraphBuilder] Visiting configuration commons-logging:commons-logging:1.2(compile).
22-Mar-2017 19:46:06 19:46:06.610 [DEBUG] [org.gradle.api.internal.artifacts.ivyservice.resolveengine.graph.DependencyGraphBuilder] Changed edges for commons-logging:commons-logging:1.2(compile) selects same versions as previous traversal. ignoring
22-Mar-2017 19:46:06 19:46:06.610 [DEBUG] [org.gradle.api.internal.artifacts.ivyservice.resolveengine.graph.DependencyGraphBuilder] Visiting configuration commons-logging:commons-logging:1.2(master).
22-Mar-2017 19:46:06 19:46:06.610 [DEBUG] [org.gradle.api.internal.artifacts.ivyservice.resolveengine.graph.DependencyGraphBuilder] Changed edges for commons-logging:commons-logging:1.2(master) selects same versions as previous traversal. ignoring
22-Mar-2017 19:46:06 19:46:06.610 [DEBUG] [org.gradle.api.internal.artifacts.ivyservice.resolveengine.graph.DependencyGraphBuilder] Visiting configuration org.apache.zookeeper:zookeeper:3.4.6(compile).
22-Mar-2017 19:46:06 19:46:06.610 [DEBUG] [org.gradle.api.internal.artifacts.ivyservice.resolveengine.graph.DependencyGraphBuilder] org.slf4j#slf4j-api is excluded from org.apache.zookeeper:zookeeper:3.4.6(compile).
22-Mar-2017 19:46:06 19:46:06.610 [DEBUG] [org.gradle.api.internal.artifacts.ivyservice.resolveengine.graph.DependencyGraphBuilder] org.slf4j#slf4j-log4j12 is excluded from org.apache.zookeeper:zookeeper:3.4.6(compile).
22-Mar-2017 19:46:06 19:46:06.610 [DEBUG] [org.gradle.api.internal.artifacts.ivyservice.resolveengine.graph.DependencyGraphBuilder] log4j#log4j is excluded from org.apache.zookeeper:zookeeper:3.4.6(compile).
22-Mar-2017 19:46:06 19:46:06.610 [DEBUG] [org.gradle.api.internal.artifacts.ivyservice.resolveengine.graph.DependencyGraphBuilder] Visiting dependency org.apache.zookeeper:zookeeper:3.4.6(compile) -> jline:jline:0.9.94(dependency: jline#jline;0.9.94 {compile=[compile(*), master(*)], runtime=[runtime(*)]})
22-Mar-2017 19:46:06 19:46:06.610 [DEBUG] [org.gradle.api.internal.artifacts.ivyservice.resolveengine.graph.DependencyGraphBuilder] Visiting dependency org.apache.zookeeper:zookeeper:3.4.6(compile) -> io.netty:netty:3.7.0.Final(dependency: io.netty#netty;3.7.0.Final {compile=[compile(*), master(*)], runtime=[runtime(*)]})
22-Mar-2017 19:46:06 19:46:06.610 [DEBUG] [org.gradle.api.internal.artifacts.ivyservice.resolveengine.graph.DependencyGraphBuilder] Visiting configuration io.netty:netty:3.7.0.Final(master).
22-Mar-2017 19:46:06 19:46:06.610 [DEBUG] [org.gradle.api.internal.artifacts.ivyservice.resolveengine.graph.DependencyGraphBuilder] version for io.netty:netty:3.7.0.Final(master) is not selected. ignoring.
22-Mar-2017 19:46:06 19:46:06.611 [DEBUG] [org.gradle.api.internal.artifacts.ivyservice.resolveengine.graph.DependencyGraphBuilder] Visiting configuration io.netty:netty:3.7.0.Final(compile).
22-Mar-2017 19:46:06 19:46:06.611 [DEBUG] [org.gradle.api.internal.artifacts.ivyservice.resolveengine.graph.DependencyGraphBuilder] version for io.netty:netty:3.7.0.Final(compile) is not selected. ignoring.
22-Mar-2017 19:46:06 19:46:06.611 [DEBUG] [org.gradle.api.internal.artifacts.ivyservice.resolveengine.graph.DependencyGraphBuilder] Visiting configuration jline:jline:2.11(master).
22-Mar-2017 19:46:06 19:46:06.611 [DEBUG] [org.gradle.api.internal.artifacts.ivyservice.resolveengine.graph.DependencyGraphBuilder] Changed edges for jline:jline:2.11(master) selects same versions as previous traversal. ignoring
22-Mar-2017 19:46:06 19:46:06.611 [DEBUG] [org.gradle.api.internal.artifacts.ivyservice.resolveengine.graph.DependencyGraphBuilder] Visiting configuration jline:jline:2.11(compile).
22-Mar-2017 19:46:06 19:46:06.611 [DEBUG] [org.gradle.api.internal.artifacts.ivyservice.resolveengine.graph.DependencyGraphBuilder] Changed edges for jline:jline:2.11(compile) selects same versions as previous traversal. ignoring
22-Mar-2017 19:46:06 19:46:06.611 [DEBUG] [org.gradle.api.internal.artifacts.ivyservice.resolveengine.graph.DependencyGraphBuilder] Visiting configuration org.apache.zookeeper:zookeeper:3.4.6(master).
22-Mar-2017 19:46:06 19:46:06.611 [DEBUG] [org.gradle.api.internal.artifacts.ivyservice.resolveengine.graph.DependencyGraphBuilder] Visiting configuration javax.xml.bind:jaxb-api:2.2.2(compile).
22-Mar-2017 19:46:06 19:46:06.611 [DEBUG] [org.gradle.api.internal.artifacts.ivyservice.resolveengine.graph.DependencyGraphBuilder] Changed edges for javax.xml.bind:jaxb-api:2.2.2(compile) selects same versions as previous traversal. ignoring
22-Mar-2017 19:46:06 19:46:06.611 [DEBUG] [org.gradle.api.internal.artifacts.ivyservice.resolveengine.graph.DependencyGraphBuilder] Visiting configuration javax.xml.bind:jaxb-api:2.2.2(master).
22-Mar-2017 19:46:06 19:46:06.611 [DEBUG] [org.gradle.api.internal.artifacts.ivyservice.resolveengine.graph.DependencyGraphBuilder] Changed edges for javax.xml.bind:jaxb-api:2.2.2(master) selects same versions as previous traversal. ignoring
22-Mar-2017 19:46:06 19:46:06.611 [DEBUG] [org.gradle.api.internal.artifacts.ivyservice.resolveengine.graph.DependencyGraphBuilder] Visiting configuration org.codehaus.jettison:jettison:1.2(compile).
22-Mar-2017 19:46:06 19:46:06.611 [DEBUG] [org.gradle.api.internal.artifacts.ivyservice.resolveengine.graph.DependencyGraphBuilder] Changed edges for org.codehaus.jettison:jettison:1.2(compile) selects same versions as previous traversal. ignoring
22-Mar-2017 19:46:06 19:46:06.611 [DEBUG] [org.gradle.api.internal.artifacts.ivyservice.resolveengine.graph.DependencyGraphBuilder] Visiting configuration org.codehaus.jettison:jettison:1.2(master).
22-Mar-2017 19:46:06 19:46:06.611 [DEBUG] [org.gradle.api.internal.artifacts.ivyservice.resolveengine.graph.DependencyGraphBuilder] Changed edges for org.codehaus.jettison:jettison:1.2(master) selects same versions as previous traversal. ignoring
22-Mar-2017 19:46:06 19:46:06.611 [DEBUG] [org.gradle.api.internal.artifacts.ivyservice.resolveengine.graph.DependencyGraphBuilder] Visiting configuration commons-lang:commons-lang:2.6(compile).
22-Mar-2017 19:46:06 19:46:06.612 [DEBUG] [org.gradle.api.internal.artifacts.ivyservice.resolveengine.graph.DependencyGraphBuilder] Changed edges for commons-lang:commons-lang:2.6(compile) selects same versions as previous traversal. ignoring
22-Mar-2017 19:46:06 19:46:06.612 [DEBUG] [org.gradle.api.internal.artifacts.ivyservice.resolveengine.graph.DependencyGraphBuilder] Visiting configuration commons-lang:commons-lang:2.6(master).
22-Mar-2017 19:46:06 19:46:06.612 [DEBUG] [org.gradle.api.internal.artifacts.ivyservice.resolveengine.graph.DependencyGraphBuilder] Changed edges for commons-lang:commons-lang:2.6(master) selects same versions as previous traversal. ignoring
22-Mar-2017 19:46:06 19:46:06.612 [DEBUG] [org.gradle.api.internal.artifacts.ivyservice.resolveengine.graph.DependencyGraphBuilder] Visiting configuration javax.servlet:servlet-api:2.5(compile).
22-Mar-2017 19:46:06 19:46:06.612 [DEBUG] [org.gradle.api.internal.artifacts.ivyservice.resolveengine.graph.DependencyGraphBuilder] Changed edges for javax.servlet:servlet-api:2.5(compile) selects same versions as previous traversal. ignoring
22-Mar-2017 19:46:06 19:46:06.612 [DEBUG] [org.gradle.api.internal.artifacts.ivyservice.resolveengine.graph.DependencyGraphBuilder] Visiting configuration javax.servlet:servlet-api:2.5(master).
22-Mar-2017 19:46:06 19:46:06.612 [DEBUG] [org.gradle.api.internal.artifacts.ivyservice.resolveengine.graph.DependencyGraphBuilder] Changed edges for javax.servlet:servlet-api:2.5(master) selects same versions as previous traversal. ignoring
22-Mar-2017 19:46:06 19:46:06.612 [DEBUG] [org.gradle.api.internal.artifacts.ivyservice.resolveengine.graph.DependencyGraphBuilder] Visiting configuration commons-codec:commons-codec:1.7(compile).
22-Mar-2017 19:46:06 19:46:06.612 [DEBUG] [org.gradle.api.internal.artifacts.ivyservice.resolveengine.graph.DependencyGraphBuilder] Changed edges for commons-codec:commons-codec:1.7(compile) selects same versions as previous traversal. ignoring
22-Mar-2017 19:46:06 19:46:06.612 [DEBUG] [org.gradle.api.internal.artifacts.ivyservice.resolveengine.graph.DependencyGraphBuilder] Visiting configuration commons-codec:commons-codec:1.7(master).
22-Mar-2017 19:46:06 19:46:06.612 [DEBUG] [org.gradle.api.internal.artifacts.ivyservice.resolveengine.graph.DependencyGraphBuilder] Changed edges for commons-codec:commons-codec:1.7(master) selects same versions as previous traversal. ignoring
22-Mar-2017 19:46:06 19:46:06.612 [DEBUG] [org.gradle.api.internal.artifacts.ivyservice.resolveengine.graph.DependencyGraphBuilder] Visiting configuration com.sun.jersey:jersey-client:1.9(compile).
22-Mar-2017 19:46:06 19:46:06.612 [DEBUG] [org.gradle.api.internal.artifacts.ivyservice.resolveengine.graph.DependencyGraphBuilder] Changed edges for com.sun.jersey:jersey-client:1.9(compile) selects same versions as previous traversal. ignoring
22-Mar-2017 19:46:06 19:46:06.612 [DEBUG] [org.gradle.api.internal.artifacts.ivyservice.resolveengine.graph.DependencyGraphBuilder] Visiting configuration com.sun.jersey:jersey-client:1.9(master).
22-Mar-2017 19:46:06 19:46:06.612 [DEBUG] [org.gradle.api.internal.artifacts.ivyservice.resolveengine.graph.DependencyGraphBuilder] Changed edges for com.sun.jersey:jersey-client:1.9(master) selects same versions as previous traversal. ignoring
22-Mar-2017 19:46:06 19:46:06.612 [DEBUG] [org.gradle.api.internal.artifacts.ivyservice.resolveengine.graph.DependencyGraphBuilder] Visiting configuration org.apache.hadoop:hadoop-annotations:2.7.1(compile).
22-Mar-2017 19:46:06 19:46:06.612 [DEBUG] [org.gradle.api.internal.artifacts.ivyservice.resolveengine.graph.DependencyGraphBuilder] Changed edges for org.apache.hadoop:hadoop-annotations:2.7.1(compile) selects same versions as previous traversal. ignoring
22-Mar-2017 19:46:06 19:46:06.612 [DEBUG] [org.gradle.api.internal.artifacts.ivyservice.resolveengine.graph.DependencyGraphBuilder] Visiting configuration org.apache.hadoop:hadoop-annotations:2.7.1(master).
22-Mar-2017 19:46:06 19:46:06.612 [DEBUG] [org.gradle.api.internal.artifacts.ivyservice.resolveengine.graph.DependencyGraphBuilder] Changed edges for org.apache.hadoop:hadoop-annotations:2.7.1(master) selects same versions as previous traversal. ignoring
22-Mar-2017 19:46:06 19:46:06.612 [DEBUG] [org.gradle.api.internal.artifacts.ivyservice.resolveengine.graph.DependencyGraphBuilder] Visiting configuration com.google.inject.extensions:guice-servlet:3.0(compile).
22-Mar-2017 19:46:06 19:46:06.612 [DEBUG] [org.gradle.api.internal.artifacts.ivyservice.resolveengine.graph.DependencyGraphBuilder] Changed edges for com.google.inject.extensions:guice-servlet:3.0(compile) selects same versions as previous traversal. ignoring
22-Mar-2017 19:46:06 19:46:06.612 [DEBUG] [org.gradle.api.internal.artifacts.ivyservice.resolveengine.graph.DependencyGraphBuilder] Visiting configuration com.google.inject.extensions:guice-servlet:3.0(master).
22-Mar-2017 19:46:06 19:46:06.612 [DEBUG] [org.gradle.api.internal.artifacts.ivyservice.resolveengine.graph.DependencyGraphBuilder] Changed edges for com.google.inject.extensions:guice-servlet:3.0(master) selects same versions as previous traversal. ignoring
22-Mar-2017 19:46:06 19:46:06.613 [DEBUG] [org.gradle.api.internal.artifacts.ivyservice.resolveengine.graph.DependencyGraphBuilder] Visiting configuration com.google.inject:guice:3.0(compile).
22-Mar-2017 19:46:06 19:46:06.613 [DEBUG] [org.gradle.api.internal.artifacts.ivyservice.resolveengine.graph.DependencyGraphBuilder] Changed edges for com.google.inject:guice:3.0(compile) selects same versions as previous traversal. ignoring
22-Mar-2017 19:46:06 19:46:06.613 [DEBUG] [org.gradle.api.internal.artifacts.ivyservice.resolveengine.graph.DependencyGraphBuilder] Visiting configuration com.google.inject:guice:3.0(master).
22-Mar-2017 19:46:06 19:46:06.613 [DEBUG] [org.gradle.api.internal.artifacts.ivyservice.resolveengine.graph.DependencyGraphBuilder] Changed edges for com.google.inject:guice:3.0(master) selects same versions as previous traversal. ignoring
22-Mar-2017 19:46:06 19:46:06.613 [DEBUG] [org.gradle.api.internal.artifacts.ivyservice.resolveengine.graph.DependencyGraphBuilder] Visiting configuration com.sun.jersey:jersey-json:1.9(compile).
22-Mar-2017 19:46:06 19:46:06.613 [DEBUG] [org.gradle.api.internal.artifacts.ivyservice.resolveengine.graph.DependencyGraphBuilder] Changed edges for com.sun.jersey:jersey-json:1.9(compile) selects same versions as previous traversal. ignoring
22-Mar-2017 19:46:06 19:46:06.613 [DEBUG] [org.gradle.api.internal.artifacts.ivyservice.resolveengine.graph.DependencyGraphBuilder] Visiting configuration com.sun.jersey:jersey-json:1.9(master).
22-Mar-2017 19:46:06 19:46:06.613 [DEBUG] [org.gradle.api.internal.artifacts.ivyservice.resolveengine.graph.DependencyGraphBuilder] Changed edges for com.sun.jersey:jersey-json:1.9(master) selects same versions as previous traversal. ignoring
22-Mar-2017 19:46:06 19:46:06.613 [DEBUG] [org.gradle.api.internal.artifacts.ivyservice.resolveengine.graph.DependencyGraphBuilder] Visiting configuration com.sun.jersey.contribs:jersey-guice:1.9(compile).
22-Mar-2017 19:46:06 19:46:06.613 [DEBUG] [org.gradle.api.internal.artifacts.ivyservice.resolveengine.graph.DependencyGraphBuilder] Changed edges for com.sun.jersey.contribs:jersey-guice:1.9(compile) selects same versions as previous traversal. ignoring
22-Mar-2017 19:46:06 19:46:06.613 [DEBUG] [org.gradle.api.internal.artifacts.ivyservice.resolveengine.graph.DependencyGraphBuilder] Visiting configuration com.sun.jersey.contribs:jersey-guice:1.9(master).
22-Mar-2017 19:46:06 19:46:06.613 [DEBUG] [org.gradle.api.internal.artifacts.ivyservice.resolveengine.graph.DependencyGraphBuilder] Changed edges for com.sun.jersey.contribs:jersey-guice:1.9(master) selects same versions as previous traversal. ignoring
22-Mar-2017 19:46:06 19:46:06.613 [DEBUG] [org.gradle.api.internal.artifacts.ivyservice.resolveengine.graph.DependencyGraphBuilder] Visiting configuration org.apache.hadoop:hadoop-yarn-server-common:2.7.1(compile).
22-Mar-2017 19:46:06 19:46:06.613 [DEBUG] [org.gradle.api.internal.artifacts.ivyservice.resolveengine.graph.DependencyGraphBuilder] Changed edges for org.apache.hadoop:hadoop-yarn-server-common:2.7.1(compile) selects same versions as previous traversal. ignoring
22-Mar-2017 19:46:06 19:46:06.613 [DEBUG] [org.gradle.api.internal.artifacts.ivyservice.resolveengine.graph.DependencyGraphBuilder] Visiting configuration org.apache.hadoop:hadoop-yarn-server-common:2.7.1(master).
22-Mar-2017 19:46:06 19:46:06.613 [DEBUG] [org.gradle.api.internal.artifacts.ivyservice.resolveengine.graph.DependencyGraphBuilder] Changed edges for org.apache.hadoop:hadoop-yarn-server-common:2.7.1(master) selects same versions as previous traversal. ignoring
22-Mar-2017 19:46:06 19:46:06.613 [DEBUG] [org.gradle.api.internal.artifacts.ivyservice.resolveengine.graph.DependencyGraphBuilder] Visiting configuration org.apache.hadoop:hadoop-yarn-api:2.7.1(runtime).
22-Mar-2017 19:46:06 19:46:06.613 [DEBUG] [org.gradle.api.internal.artifacts.ivyservice.resolveengine.graph.DependencyGraphBuilder] Changed edges for org.apache.hadoop:hadoop-yarn-api:2.7.1(runtime) selects same versions as previous traversal. ignoring
22-Mar-2017 19:46:06 19:46:06.613 [DEBUG] [org.gradle.api.internal.artifacts.ivyservice.resolveengine.graph.DependencyGraphBuilder] Visiting configuration org.apache.hadoop:hadoop-yarn-common:2.7.1(runtime).
22-Mar-2017 19:46:06 19:46:06.613 [DEBUG] [org.gradle.api.internal.artifacts.ivyservice.resolveengine.graph.DependencyGraphBuilder] Changed edges for org.apache.hadoop:hadoop-yarn-common:2.7.1(runtime) selects same versions as previous traversal. ignoring
22-Mar-2017 19:46:06 19:46:06.613 [DEBUG] [org.gradle.api.internal.artifacts.ivyservice.resolveengine.graph.DependencyGraphBuilder] Visiting configuration commons-logging:commons-logging:1.2(runtime).
22-Mar-2017 19:46:06 19:46:06.613 [DEBUG] [org.gradle.api.internal.artifacts.ivyservice.resolveengine.graph.DependencyGraphBuilder] Changed edges for commons-logging:commons-logging:1.2(runtime) selects same versions as previous traversal. ignoring
22-Mar-2017 19:46:06 19:46:06.614 [DEBUG] [org.gradle.api.internal.artifacts.ivyservice.resolveengine.graph.DependencyGraphBuilder] Visiting configuration org.apache.zookeeper:zookeeper:3.4.6(runtime).
22-Mar-2017 19:46:06 19:46:06.614 [DEBUG] [org.gradle.api.internal.artifacts.ivyservice.resolveengine.graph.DependencyGraphBuilder] org.slf4j#slf4j-api is excluded from org.apache.zookeeper:zookeeper:3.4.6(runtime).
22-Mar-2017 19:46:06 19:46:06.614 [DEBUG] [org.gradle.api.internal.artifacts.ivyservice.resolveengine.graph.DependencyGraphBuilder] org.slf4j#slf4j-log4j12 is excluded from org.apache.zookeeper:zookeeper:3.4.6(runtime).
22-Mar-2017 19:46:06 19:46:06.614 [DEBUG] [org.gradle.api.internal.artifacts.ivyservice.resolveengine.graph.DependencyGraphBuilder] log4j#log4j is excluded from org.apache.zookeeper:zookeeper:3.4.6(runtime).
22-Mar-2017 19:46:06 19:46:06.614 [DEBUG] [org.gradle.api.internal.artifacts.ivyservice.resolveengine.graph.DependencyGraphBuilder] Visiting dependency org.apache.zookeeper:zookeeper:3.4.6(runtime) -> jline:jline:0.9.94(dependency: jline#jline;0.9.94 {compile=[compile(*), master(*)], runtime=[runtime(*)]})
22-Mar-2017 19:46:06 19:46:06.614 [DEBUG] [org.gradle.api.internal.artifacts.ivyservice.resolveengine.graph.DependencyGraphBuilder] Visiting dependency org.apache.zookeeper:zookeeper:3.4.6(runtime) -> io.netty:netty:3.7.0.Final(dependency: io.netty#netty;3.7.0.Final {compile=[compile(*), master(*)], runtime=[runtime(*)]})
22-Mar-2017 19:46:06 19:46:06.614 [DEBUG] [org.gradle.api.internal.artifacts.ivyservice.resolveengine.graph.DependencyGraphBuilder] Visiting configuration io.netty:netty:3.7.0.Final(runtime).
22-Mar-2017 19:46:06 19:46:06.614 [DEBUG] [org.gradle.api.internal.artifacts.ivyservice.resolveengine.graph.DependencyGraphBuilder] version for io.netty:netty:3.7.0.Final(runtime) is not selected. ignoring.
22-Mar-2017 19:46:06 19:46:06.614 [DEBUG] [org.gradle.api.internal.artifacts.ivyservice.resolveengine.graph.DependencyGraphBuilder] Visiting configuration io.netty:netty:3.7.0.Final(master).
22-Mar-2017 19:46:06 19:46:06.614 [DEBUG] [org.gradle.api.internal.artifacts.ivyservice.resolveengine.graph.DependencyGraphBuilder] version for io.netty:netty:3.7.0.Final(master) is not selected. ignoring.
22-Mar-2017 19:46:06 19:46:06.614 [DEBUG] [org.gradle.api.internal.artifacts.ivyservice.resolveengine.graph.DependencyGraphBuilder] Visiting configuration io.netty:netty:3.7.0.Final(compile).
22-Mar-2017 19:46:06 19:46:06.614 [DEBUG] [org.gradle.api.internal.artifacts.ivyservice.resolveengine.graph.DependencyGraphBuilder] version for io.netty:netty:3.7.0.Final(compile) is not selected. ignoring.
22-Mar-2017 19:46:06 19:46:06.614 [DEBUG] [org.gradle.api.internal.artifacts.ivyservice.resolveengine.graph.DependencyGraphBuilder] Visiting configuration jline:jline:2.11(runtime).
22-Mar-2017 19:46:06 19:46:06.614 [DEBUG] [org.gradle.api.internal.artifacts.ivyservice.resolveengine.graph.DependencyGraphBuilder] Changed edges for jline:jline:2.11(runtime) selects same versions as previous traversal. ignoring
22-Mar-2017 19:46:06 19:46:06.614 [DEBUG] [org.gradle.api.internal.artifacts.ivyservice.resolveengine.graph.DependencyGraphBuilder] Visiting configuration jline:jline:2.11(master).
22-Mar-2017 19:46:06 19:46:06.614 [DEBUG] [org.gradle.api.internal.artifacts.ivyservice.resolveengine.graph.DependencyGraphBuilder] Changed edges for jline:jline:2.11(master) selects same versions as previous traversal. ignoring
22-Mar-2017 19:46:06 19:46:06.614 [DEBUG] [org.gradle.api.internal.artifacts.ivyservice.resolveengine.graph.DependencyGraphBuilder] Visiting configuration jline:jline:2.11(compile).
22-Mar-2017 19:46:06 19:46:06.614 [DEBUG] [org.gradle.api.internal.artifacts.ivyservice.resolveengine.graph.DependencyGraphBuilder] Changed edges for jline:jline:2.11(compile) selects same versions as previous traversal. ignoring
22-Mar-2017 19:46:06 19:46:06.614 [DEBUG] [org.gradle.api.internal.artifacts.ivyservice.resolveengine.graph.DependencyGraphBuilder] Visiting configuration org.fusesource.leveldbjni:leveldbjni-all:1.8(compile).
22-Mar-2017 19:46:06 19:46:06.614 [DEBUG] [org.gradle.api.internal.artifacts.ivyservice.resolveengine.graph.DependencyGraphBuilder] Changed edges for org.fusesource.leveldbjni:leveldbjni-all:1.8(compile) selects same versions as previous traversal. ignoring
22-Mar-2017 19:46:06 19:46:06.614 [DEBUG] [org.gradle.api.internal.artifacts.ivyservice.resolveengine.graph.DependencyGraphBuilder] Visiting configuration org.fusesource.leveldbjni:leveldbjni-all:1.8(master).
22-Mar-2017 19:46:06 19:46:06.614 [DEBUG] [org.gradle.api.internal.artifacts.ivyservice.resolveengine.graph.DependencyGraphBuilder] Changed edges for org.fusesource.leveldbjni:leveldbjni-all:1.8(master) selects same versions as previous traversal. ignoring
22-Mar-2017 19:46:06 19:46:06.615 [DEBUG] [org.gradle.api.internal.artifacts.ivyservice.resolveengine.graph.DependencyGraphBuilder] Visiting configuration javax.xml.bind:jaxb-api:2.2.2(runtime).
22-Mar-2017 19:46:06 19:46:06.615 [DEBUG] [org.gradle.api.internal.artifacts.ivyservice.resolveengine.graph.DependencyGraphBuilder] Changed edges for javax.xml.bind:jaxb-api:2.2.2(runtime) selects same versions as previous traversal. ignoring
22-Mar-2017 19:46:06 19:46:06.615 [DEBUG] [org.gradle.api.internal.artifacts.ivyservice.resolveengine.graph.DependencyGraphBuilder] Visiting configuration org.codehaus.jettison:jettison:1.2(runtime).
22-Mar-2017 19:46:06 19:46:06.615 [DEBUG] [org.gradle.api.internal.artifacts.ivyservice.resolveengine.graph.DependencyGraphBuilder] Changed edges for org.codehaus.jettison:jettison:1.2(runtime) selects same versions as previous traversal. ignoring
22-Mar-2017 19:46:06 19:46:06.615 [DEBUG] [org.gradle.api.internal.artifacts.ivyservice.resolveengine.graph.DependencyGraphBuilder] Visiting configuration commons-lang:commons-lang:2.6(runtime).
22-Mar-2017 19:46:06 19:46:06.615 [DEBUG] [org.gradle.api.internal.artifacts.ivyservice.resolveengine.graph.DependencyGraphBuilder] Changed edges for commons-lang:commons-lang:2.6(runtime) selects same versions as previous traversal. ignoring
22-Mar-2017 19:46:06 19:46:06.615 [DEBUG] [org.gradle.api.internal.artifacts.ivyservice.resolveengine.graph.DependencyGraphBuilder] Visiting configuration javax.servlet:servlet-api:2.5(runtime).
22-Mar-2017 19:46:06 19:46:06.615 [DEBUG] [org.gradle.api.internal.artifacts.ivyservice.resolveengine.graph.DependencyGraphBuilder] Changed edges for javax.servlet:servlet-api:2.5(runtime) selects same versions as previous traversal. ignoring
22-Mar-2017 19:46:06 19:46:06.615 [DEBUG] [org.gradle.api.internal.artifacts.ivyservice.resolveengine.graph.DependencyGraphBuilder] Visiting configuration commons-codec:commons-codec:1.7(runtime).
22-Mar-2017 19:46:06 19:46:06.615 [DEBUG] [org.gradle.api.internal.artifacts.ivyservice.resolveengine.graph.DependencyGraphBuilder] Changed edges for commons-codec:commons-codec:1.7(runtime) selects same versions as previous traversal. ignoring
22-Mar-2017 19:46:06 19:46:06.615 [DEBUG] [org.gradle.api.internal.artifacts.ivyservice.resolveengine.graph.DependencyGraphBuilder] Visiting configuration com.sun.jersey:jersey-client:1.9(runtime).
22-Mar-2017 19:46:06 19:46:06.615 [DEBUG] [org.gradle.api.internal.artifacts.ivyservice.resolveengine.graph.DependencyGraphBuilder] Changed edges for com.sun.jersey:jersey-client:1.9(runtime) selects same versions as previous traversal. ignoring
22-Mar-2017 19:46:06 19:46:06.615 [DEBUG] [org.gradle.api.internal.artifacts.ivyservice.resolveengine.graph.DependencyGraphBuilder] Visiting configuration org.apache.hadoop:hadoop-annotations:2.7.1(runtime).
22-Mar-2017 19:46:06 19:46:06.615 [DEBUG] [org.gradle.api.internal.artifacts.ivyservice.resolveengine.graph.DependencyGraphBuilder] Changed edges for org.apache.hadoop:hadoop-annotations:2.7.1(runtime) selects same versions as previous traversal. ignoring
22-Mar-2017 19:46:06 19:46:06.615 [DEBUG] [org.gradle.api.internal.artifacts.ivyservice.resolveengine.graph.DependencyGraphBuilder] Visiting configuration com.google.inject.extensions:guice-servlet:3.0(runtime).
22-Mar-2017 19:46:06 19:46:06.615 [DEBUG] [org.gradle.api.internal.artifacts.ivyservice.resolveengine.graph.DependencyGraphBuilder] Changed edges for com.google.inject.extensions:guice-servlet:3.0(runtime) selects same versions as previous traversal. ignoring
22-Mar-2017 19:46:06 19:46:06.615 [DEBUG] [org.gradle.api.internal.artifacts.ivyservice.resolveengine.graph.DependencyGraphBuilder] Visiting configuration com.google.protobuf:protobuf-java:2.5.0(compile).
22-Mar-2017 19:46:06 19:46:06.615 [DEBUG] [org.gradle.api.internal.artifacts.ivyservice.resolveengine.graph.DependencyGraphBuilder] Changed edges for com.google.protobuf:protobuf-java:2.5.0(compile) selects same versions as previous traversal. ignoring
22-Mar-2017 19:46:06 19:46:06.615 [DEBUG] [org.gradle.api.internal.artifacts.ivyservice.resolveengine.graph.DependencyGraphBuilder] Visiting configuration com.google.protobuf:protobuf-java:2.5.0(master).
22-Mar-2017 19:46:06 19:46:06.615 [DEBUG] [org.gradle.api.internal.artifacts.ivyservice.resolveengine.graph.DependencyGraphBuilder] Changed edges for com.google.protobuf:protobuf-java:2.5.0(master) selects same versions as previous traversal. ignoring
22-Mar-2017 19:46:06 19:46:06.615 [DEBUG] [org.gradle.api.internal.artifacts.ivyservice.resolveengine.graph.DependencyGraphBuilder] Visiting configuration com.google.protobuf:protobuf-java:2.5.0(runtime).
22-Mar-2017 19:46:06 19:46:06.615 [DEBUG] [org.gradle.api.internal.artifacts.ivyservice.resolveengine.graph.DependencyGraphBuilder] Changed edges for com.google.protobuf:protobuf-java:2.5.0(runtime) selects same versions as previous traversal. ignoring
22-Mar-2017 19:46:06 19:46:06.615 [DEBUG] [org.gradle.api.internal.artifacts.ivyservice.resolveengine.graph.DependencyGraphBuilder] Visiting configuration com.google.inject:guice:3.0(runtime).
22-Mar-2017 19:46:06 19:46:06.616 [DEBUG] [org.gradle.api.internal.artifacts.ivyservice.resolveengine.graph.DependencyGraphBuilder] Changed edges for com.google.inject:guice:3.0(runtime) selects same versions as previous traversal. ignoring
22-Mar-2017 19:46:06 19:46:06.616 [DEBUG] [org.gradle.api.internal.artifacts.ivyservice.resolveengine.graph.DependencyGraphBuilder] Visiting configuration com.sun.jersey:jersey-json:1.9(runtime).
22-Mar-2017 19:46:06 19:46:06.616 [DEBUG] [org.gradle.api.internal.artifacts.ivyservice.resolveengine.graph.DependencyGraphBuilder] Changed edges for com.sun.jersey:jersey-json:1.9(runtime) selects same versions as previous traversal. ignoring
22-Mar-2017 19:46:06 19:46:06.616 [DEBUG] [org.gradle.api.internal.artifacts.ivyservice.resolveengine.graph.DependencyGraphBuilder] Visiting configuration com.sun.jersey.contribs:jersey-guice:1.9(runtime).
22-Mar-2017 19:46:06 19:46:06.616 [DEBUG] [org.gradle.api.internal.artifacts.ivyservice.resolveengine.graph.DependencyGraphBuilder] Changed edges for com.sun.jersey.contribs:jersey-guice:1.9(runtime) selects same versions as previous traversal. ignoring
22-Mar-2017 19:46:06 19:46:06.616 [DEBUG] [org.gradle.api.internal.artifacts.ivyservice.resolveengine.graph.DependencyGraphBuilder] Visiting configuration org.apache.hadoop:hadoop-yarn-server-common:2.7.1(runtime).
22-Mar-2017 19:46:06 19:46:06.616 [DEBUG] [org.gradle.api.internal.artifacts.ivyservice.resolveengine.graph.DependencyGraphBuilder] Changed edges for org.apache.hadoop:hadoop-yarn-server-common:2.7.1(runtime) selects same versions as previous traversal. ignoring
22-Mar-2017 19:46:06 19:46:06.616 [DEBUG] [org.gradle.api.internal.artifacts.ivyservice.resolveengine.graph.conflicts.DefaultConflictHandler] Selected org.eclipse.aether:aether-api:0.9.1.v20140329 from conflicting modules [org.eclipse.aether:aether-api:0.9.1.v20140329, org.eclipse.aether:aether-api:0.9.0.M2].
22-Mar-2017 19:46:06 19:46:06.616 [DEBUG] [org.gradle.api.internal.artifacts.ivyservice.resolveengine.graph.DependencyGraphBuilder] Visiting configuration org.eclipse.aether:aether-api:0.9.1.v20140329(compile).
22-Mar-2017 19:46:06 19:46:06.616 [DEBUG] [org.gradle.api.internal.artifacts.ivyservice.resolveengine.graph.DependencyGraphBuilder] Visiting configuration org.eclipse.aether:aether-api:0.9.1.v20140329(master).
22-Mar-2017 19:46:06 19:46:06.616 [DEBUG] [org.gradle.api.internal.artifacts.ivyservice.resolveengine.graph.DependencyGraphBuilder] Visiting configuration org.eclipse.aether:aether-api:0.9.1.v20140329(runtime).
22-Mar-2017 19:46:06 19:46:06.616 [DEBUG] [org.gradle.api.internal.artifacts.ivyservice.resolveengine.graph.conflicts.DefaultConflictHandler] Selected org.eclipse.aether:aether-spi:0.9.1.v20140329 from conflicting modules [org.eclipse.aether:aether-spi:0.9.1.v20140329, org.eclipse.aether:aether-spi:0.9.0.M2].
22-Mar-2017 19:46:06 19:46:06.616 [DEBUG] [org.gradle.api.internal.artifacts.ivyservice.resolveengine.graph.DependencyGraphBuilder] Visiting configuration org.eclipse.aether:aether-spi:0.9.1.v20140329(compile).
22-Mar-2017 19:46:06 19:46:06.616 [DEBUG] [org.gradle.api.internal.artifacts.ivyservice.resolveengine.graph.DependencyGraphBuilder] Visiting dependency org.eclipse.aether:aether-spi:0.9.1.v20140329(compile) -> org.eclipse.aether:aether-api:0.9.1.v20140329(dependency: org.eclipse.aether#aether-api;0.9.1.v20140329 {compile=[compile(*), master(*)], runtime=[runtime(*)]})
22-Mar-2017 19:46:06 19:46:06.617 [DEBUG] [org.gradle.api.internal.artifacts.ivyservice.resolveengine.graph.DependencyGraphBuilder] Visiting configuration org.eclipse.aether:aether-spi:0.9.1.v20140329(master).
22-Mar-2017 19:46:06 19:46:06.617 [DEBUG] [org.gradle.api.internal.artifacts.ivyservice.resolveengine.graph.DependencyGraphBuilder] Visiting configuration org.eclipse.aether:aether-spi:0.9.1.v20140329(runtime).
22-Mar-2017 19:46:06 19:46:06.617 [DEBUG] [org.gradle.api.internal.artifacts.ivyservice.resolveengine.graph.DependencyGraphBuilder] Visiting dependency org.eclipse.aether:aether-spi:0.9.1.v20140329(runtime) -> org.eclipse.aether:aether-api:0.9.1.v20140329(dependency: org.eclipse.aether#aether-api;0.9.1.v20140329 {compile=[compile(*), master(*)], runtime=[runtime(*)]})
22-Mar-2017 19:46:06 19:46:06.617 [DEBUG] [org.gradle.api.internal.artifacts.ivyservice.resolveengine.graph.DependencyGraphBuilder] Visiting configuration org.eclipse.aether:aether-api:0.9.1.v20140329(compile).
22-Mar-2017 19:46:06 19:46:06.617 [DEBUG] [org.gradle.api.internal.artifacts.ivyservice.resolveengine.graph.DependencyGraphBuilder] Changed edges for org.eclipse.aether:aether-api:0.9.1.v20140329(compile) selects same versions as previous traversal. ignoring
22-Mar-2017 19:46:06 19:46:06.617 [DEBUG] [org.gradle.api.internal.artifacts.ivyservice.resolveengine.graph.DependencyGraphBuilder] Visiting configuration org.eclipse.aether:aether-api:0.9.1.v20140329(master).
22-Mar-2017 19:46:06 19:46:06.617 [DEBUG] [org.gradle.api.internal.artifacts.ivyservice.resolveengine.graph.DependencyGraphBuilder] Changed edges for org.eclipse.aether:aether-api:0.9.1.v20140329(master) selects same versions as previous traversal. ignoring
22-Mar-2017 19:46:06 19:46:06.617 [DEBUG] [org.gradle.api.internal.artifacts.ivyservice.resolveengine.graph.DependencyGraphBuilder] Visiting configuration org.eclipse.aether:aether-api:0.9.1.v20140329(runtime).
22-Mar-2017 19:46:06 19:46:06.617 [DEBUG] [org.gradle.api.internal.artifacts.ivyservice.resolveengine.graph.DependencyGraphBuilder] Changed edges for org.eclipse.aether:aether-api:0.9.1.v20140329(runtime) selects same versions as previous traversal. ignoring
22-Mar-2017 19:46:06 19:46:06.617 [DEBUG] [org.gradle.api.internal.artifacts.ivyservice.resolveengine.graph.conflicts.DefaultConflictHandler] Selected org.eclipse.aether:aether-util:0.9.1.v20140329 from conflicting modules [org.eclipse.aether:aether-util:0.9.1.v20140329, org.eclipse.aether:aether-util:0.9.0.M2].
22-Mar-2017 19:46:06 19:46:06.617 [DEBUG] [org.gradle.api.internal.artifacts.ivyservice.resolveengine.graph.DependencyGraphBuilder] Visiting configuration org.eclipse.aether:aether-util:0.9.1.v20140329(compile).
22-Mar-2017 19:46:06 19:46:06.617 [DEBUG] [org.gradle.api.internal.artifacts.ivyservice.resolveengine.graph.DependencyGraphBuilder] Visiting dependency org.eclipse.aether:aether-util:0.9.1.v20140329(compile) -> org.eclipse.aether:aether-api:0.9.1.v20140329(dependency: org.eclipse.aether#aether-api;0.9.1.v20140329 {compile=[compile(*), master(*)], runtime=[runtime(*)]})
22-Mar-2017 19:46:06 19:46:06.617 [DEBUG] [org.gradle.api.internal.artifacts.ivyservice.resolveengine.graph.DependencyGraphBuilder] Visiting configuration org.eclipse.aether:aether-util:0.9.1.v20140329(master).
22-Mar-2017 19:46:06 19:46:06.617 [DEBUG] [org.gradle.api.internal.artifacts.ivyservice.resolveengine.graph.DependencyGraphBuilder] Visiting configuration org.eclipse.aether:aether-util:0.9.1.v20140329(runtime).
22-Mar-2017 19:46:06 19:46:06.618 [DEBUG] [org.gradle.api.internal.artifacts.ivyservice.resolveengine.graph.DependencyGraphBuilder] Visiting dependency org.eclipse.aether:aether-util:0.9.1.v20140329(runtime) -> org.eclipse.aether:aether-api:0.9.1.v20140329(dependency: org.eclipse.aether#aether-api;0.9.1.v20140329 {compile=[compile(*), master(*)], runtime=[runtime(*)]})
22-Mar-2017 19:46:06 19:46:06.618 [DEBUG] [org.gradle.api.internal.artifacts.ivyservice.resolveengine.graph.DependencyGraphBuilder] Visiting configuration org.eclipse.aether:aether-api:0.9.1.v20140329(compile).
22-Mar-2017 19:46:06 19:46:06.618 [DEBUG] [org.gradle.api.internal.artifacts.ivyservice.resolveengine.graph.DependencyGraphBuilder] Changed edges for org.eclipse.aether:aether-api:0.9.1.v20140329(compile) selects same versions as previous traversal. ignoring
22-Mar-2017 19:46:06 19:46:06.618 [DEBUG] [org.gradle.api.internal.artifacts.ivyservice.resolveengine.graph.DependencyGraphBuilder] Visiting configuration org.eclipse.aether:aether-api:0.9.1.v20140329(master).
22-Mar-2017 19:46:06 19:46:06.618 [DEBUG] [org.gradle.api.internal.artifacts.ivyservice.resolveengine.graph.DependencyGraphBuilder] Changed edges for org.eclipse.aether:aether-api:0.9.1.v20140329(master) selects same versions as previous traversal. ignoring
22-Mar-2017 19:46:06 19:46:06.618 [DEBUG] [org.gradle.api.internal.artifacts.ivyservice.resolveengine.graph.DependencyGraphBuilder] Visiting configuration org.eclipse.aether:aether-api:0.9.1.v20140329(runtime).
22-Mar-2017 19:46:06 19:46:06.618 [DEBUG] [org.gradle.api.internal.artifacts.ivyservice.resolveengine.graph.DependencyGraphBuilder] Changed edges for org.eclipse.aether:aether-api:0.9.1.v20140329(runtime) selects same versions as previous traversal. ignoring
22-Mar-2017 19:46:06 19:46:06.618 [DEBUG] [org.gradle.api.internal.artifacts.ivyservice.resolveengine.graph.conflicts.DefaultConflictHandler] Selected org.eclipse.aether:aether-impl:0.9.1.v20140329 from conflicting modules [org.eclipse.aether:aether-impl:0.9.1.v20140329, org.eclipse.aether:aether-impl:0.9.0.M2].
22-Mar-2017 19:46:06 19:46:06.618 [DEBUG] [org.gradle.api.internal.artifacts.ivyservice.resolveengine.graph.DependencyGraphBuilder] Visiting configuration org.eclipse.aether:aether-impl:0.9.1.v20140329(compile).
22-Mar-2017 19:46:06 19:46:06.618 [DEBUG] [org.gradle.api.internal.artifacts.ivyservice.resolveengine.graph.DependencyGraphBuilder] Visiting dependency org.eclipse.aether:aether-impl:0.9.1.v20140329(compile) -> org.eclipse.aether:aether-api:0.9.1.v20140329(dependency: org.eclipse.aether#aether-api;0.9.1.v20140329 {compile=[compile(*), master(*)], runtime=[runtime(*)]})
22-Mar-2017 19:46:06 19:46:06.618 [DEBUG] [org.gradle.api.internal.artifacts.ivyservice.resolveengine.graph.DependencyGraphBuilder] Visiting dependency org.eclipse.aether:aether-impl:0.9.1.v20140329(compile) -> org.eclipse.aether:aether-spi:0.9.1.v20140329(dependency: org.eclipse.aether#aether-spi;0.9.1.v20140329 {compile=[compile(*), master(*)], runtime=[runtime(*)]})
22-Mar-2017 19:46:06 19:46:06.618 [DEBUG] [org.gradle.api.internal.artifacts.ivyservice.resolveengine.graph.DependencyGraphBuilder] Visiting dependency org.eclipse.aether:aether-impl:0.9.1.v20140329(compile) -> org.eclipse.aether:aether-util:0.9.1.v20140329(dependency: org.eclipse.aether#aether-util;0.9.1.v20140329 {compile=[compile(*), master(*)], runtime=[runtime(*)]})
22-Mar-2017 19:46:06 19:46:06.618 [DEBUG] [org.gradle.api.internal.artifacts.ivyservice.resolveengine.graph.DependencyGraphBuilder] Visiting configuration org.eclipse.aether:aether-impl:0.9.1.v20140329(master).
22-Mar-2017 19:46:06 19:46:06.618 [DEBUG] [org.gradle.api.internal.artifacts.ivyservice.resolveengine.graph.DependencyGraphBuilder] Visiting configuration org.eclipse.aether:aether-impl:0.9.1.v20140329(runtime).
22-Mar-2017 19:46:06 19:46:06.618 [DEBUG] [org.gradle.api.internal.artifacts.ivyservice.resolveengine.graph.DependencyGraphBuilder] Visiting dependency org.eclipse.aether:aether-impl:0.9.1.v20140329(runtime) -> org.eclipse.aether:aether-api:0.9.1.v20140329(dependency: org.eclipse.aether#aether-api;0.9.1.v20140329 {compile=[compile(*), master(*)], runtime=[runtime(*)]})
22-Mar-2017 19:46:06 19:46:06.619 [DEBUG] [org.gradle.api.internal.artifacts.ivyservice.resolveengine.graph.DependencyGraphBuilder] Visiting dependency org.eclipse.aether:aether-impl:0.9.1.v20140329(runtime) -> org.eclipse.aether:aether-spi:0.9.1.v20140329(dependency: org.eclipse.aether#aether-spi;0.9.1.v20140329 {compile=[compile(*), master(*)], runtime=[runtime(*)]})
22-Mar-2017 19:46:06 19:46:06.619 [DEBUG] [org.gradle.api.internal.artifacts.ivyservice.resolveengine.graph.DependencyGraphBuilder] Visiting dependency org.eclipse.aether:aether-impl:0.9.1.v20140329(runtime) -> org.eclipse.aether:aether-util:0.9.1.v20140329(dependency: org.eclipse.aether#aether-util;0.9.1.v20140329 {compile=[compile(*), master(*)], runtime=[runtime(*)]})
22-Mar-2017 19:46:06 19:46:06.619 [DEBUG] [org.gradle.api.internal.artifacts.ivyservice.resolveengine.graph.DependencyGraphBuilder] Visiting configuration org.eclipse.aether:aether-api:0.9.1.v20140329(compile).
22-Mar-2017 19:46:06 19:46:06.619 [DEBUG] [org.gradle.api.internal.artifacts.ivyservice.resolveengine.graph.DependencyGraphBuilder] Changed edges for org.eclipse.aether:aether-api:0.9.1.v20140329(compile) selects same versions as previous traversal. ignoring
22-Mar-2017 19:46:06 19:46:06.619 [DEBUG] [org.gradle.api.internal.artifacts.ivyservice.resolveengine.graph.DependencyGraphBuilder] Visiting configuration org.eclipse.aether:aether-api:0.9.1.v20140329(master).
22-Mar-2017 19:46:06 19:46:06.619 [DEBUG] [org.gradle.api.internal.artifacts.ivyservice.resolveengine.graph.DependencyGraphBuilder] Changed edges for org.eclipse.aether:aether-api:0.9.1.v20140329(master) selects same versions as previous traversal. ignoring
22-Mar-2017 19:46:06 19:46:06.619 [DEBUG] [org.gradle.api.internal.artifacts.ivyservice.resolveengine.graph.DependencyGraphBuilder] Visiting configuration org.eclipse.aether:aether-spi:0.9.1.v20140329(compile).
22-Mar-2017 19:46:06 19:46:06.619 [DEBUG] [org.gradle.api.internal.artifacts.ivyservice.resolveengine.graph.DependencyGraphBuilder] Changed edges for org.eclipse.aether:aether-spi:0.9.1.v20140329(compile) selects same versions as previous traversal. ignoring
22-Mar-2017 19:46:06 19:46:06.619 [DEBUG] [org.gradle.api.internal.artifacts.ivyservice.resolveengine.graph.DependencyGraphBuilder] Visiting configuration org.eclipse.aether:aether-spi:0.9.1.v20140329(master).
22-Mar-2017 19:46:06 19:46:06.619 [DEBUG] [org.gradle.api.internal.artifacts.ivyservice.resolveengine.graph.DependencyGraphBuilder] Changed edges for org.eclipse.aether:aether-spi:0.9.1.v20140329(master) selects same versions as previous traversal. ignoring
22-Mar-2017 19:46:06 19:46:06.619 [DEBUG] [org.gradle.api.internal.artifacts.ivyservice.resolveengine.graph.DependencyGraphBuilder] Visiting configuration org.eclipse.aether:aether-util:0.9.1.v20140329(compile).
22-Mar-2017 19:46:06 19:46:06.619 [DEBUG] [org.gradle.api.internal.artifacts.ivyservice.resolveengine.graph.DependencyGraphBuilder] Changed edges for org.eclipse.aether:aether-util:0.9.1.v20140329(compile) selects same versions as previous traversal. ignoring
22-Mar-2017 19:46:06 19:46:06.619 [DEBUG] [org.gradle.api.internal.artifacts.ivyservice.resolveengine.graph.DependencyGraphBuilder] Visiting configuration org.eclipse.aether:aether-util:0.9.1.v20140329(master).
22-Mar-2017 19:46:06 19:46:06.619 [DEBUG] [org.gradle.api.internal.artifacts.ivyservice.resolveengine.graph.DependencyGraphBuilder] Changed edges for org.eclipse.aether:aether-util:0.9.1.v20140329(master) selects same versions as previous traversal. ignoring
22-Mar-2017 19:46:06 19:46:06.619 [DEBUG] [org.gradle.api.internal.artifacts.ivyservice.resolveengine.graph.DependencyGraphBuilder] Visiting configuration org.eclipse.aether:aether-api:0.9.1.v20140329(runtime).
22-Mar-2017 19:46:06 19:46:06.619 [DEBUG] [org.gradle.api.internal.artifacts.ivyservice.resolveengine.graph.DependencyGraphBuilder] Changed edges for org.eclipse.aether:aether-api:0.9.1.v20140329(runtime) selects same versions as previous traversal. ignoring
22-Mar-2017 19:46:06 19:46:06.619 [DEBUG] [org.gradle.api.internal.artifacts.ivyservice.resolveengine.graph.DependencyGraphBuilder] Visiting configuration org.eclipse.aether:aether-spi:0.9.1.v20140329(runtime).
22-Mar-2017 19:46:06 19:46:06.619 [DEBUG] [org.gradle.api.internal.artifacts.ivyservice.resolveengine.graph.DependencyGraphBuilder] Changed edges for org.eclipse.aether:aether-spi:0.9.1.v20140329(runtime) selects same versions as previous traversal. ignoring
22-Mar-2017 19:46:06 19:46:06.620 [DEBUG] [org.gradle.api.internal.artifacts.ivyservice.resolveengine.graph.DependencyGraphBuilder] Visiting configuration org.eclipse.aether:aether-util:0.9.1.v20140329(runtime).
22-Mar-2017 19:46:06 19:46:06.620 [DEBUG] [org.gradle.api.internal.artifacts.ivyservice.resolveengine.graph.DependencyGraphBuilder] Changed edges for org.eclipse.aether:aether-util:0.9.1.v20140329(runtime) selects same versions as previous traversal. ignoring
22-Mar-2017 19:46:06 19:46:06.620 [DEBUG] [org.gradle.api.internal.artifacts.ivyservice.resolveengine.graph.conflicts.DefaultConflictHandler] Selected org.codehaus.plexus:plexus-utils:3.0.17 from conflicting modules [org.codehaus.plexus:plexus-utils:3.0.17, org.codehaus.plexus:plexus-utils:3.0.15, org.codehaus.plexus:plexus-utils:1.5.5].
22-Mar-2017 19:46:06 19:46:06.620 [DEBUG] [org.gradle.api.internal.artifacts.ivyservice.resolveengine.graph.DependencyGraphBuilder] Visiting configuration org.codehaus.plexus:plexus-utils:3.0.17(compile).
22-Mar-2017 19:46:06 19:46:06.620 [DEBUG] [org.gradle.api.internal.artifacts.ivyservice.resolveengine.graph.DependencyGraphBuilder] Visiting configuration org.codehaus.plexus:plexus-utils:3.0.17(master).
22-Mar-2017 19:46:06 19:46:06.620 [DEBUG] [org.gradle.api.internal.artifacts.ivyservice.resolveengine.graph.DependencyGraphBuilder] Visiting configuration org.codehaus.plexus:plexus-utils:3.0.17(runtime).
22-Mar-2017 19:46:06 19:46:06.620 [DEBUG] [org.gradle.api.internal.artifacts.ivyservice.resolveengine.graph.conflicts.DefaultConflictHandler] Selected org.codehaus.jackson:jackson-jaxrs:1.9.13 from conflicting modules [org.codehaus.jackson:jackson-jaxrs:1.9.13, org.codehaus.jackson:jackson-jaxrs:1.8.3].
22-Mar-2017 19:46:06 19:46:06.620 [DEBUG] [org.gradle.api.internal.artifacts.ivyservice.resolveengine.graph.DependencyGraphBuilder] Visiting configuration org.codehaus.jackson:jackson-jaxrs:1.9.13(compile).
22-Mar-2017 19:46:06 19:46:06.620 [DEBUG] [org.gradle.api.internal.artifacts.ivyservice.resolveengine.graph.DependencyGraphBuilder] org.codehaus.jackson#jackson-core-asl is excluded from org.codehaus.jackson:jackson-jaxrs:1.9.13(compile).
22-Mar-2017 19:46:06 19:46:06.620 [DEBUG] [org.gradle.api.internal.artifacts.ivyservice.resolveengine.graph.DependencyGraphBuilder] org.codehaus.jackson#jackson-mapper-asl is excluded from org.codehaus.jackson:jackson-jaxrs:1.9.13(compile).
22-Mar-2017 19:46:06 19:46:06.620 [DEBUG] [org.gradle.api.internal.artifacts.ivyservice.resolveengine.graph.DependencyGraphBuilder] Visiting configuration org.codehaus.jackson:jackson-jaxrs:1.9.13(master).
22-Mar-2017 19:46:06 19:46:06.621 [DEBUG] [org.gradle.api.internal.artifacts.ivyservice.resolveengine.graph.DependencyGraphBuilder] Visiting configuration org.codehaus.jackson:jackson-jaxrs:1.9.13(runtime).
22-Mar-2017 19:46:06 19:46:06.621 [DEBUG] [org.gradle.api.internal.artifacts.ivyservice.resolveengine.graph.DependencyGraphBuilder] org.codehaus.jackson#jackson-core-asl is excluded from org.codehaus.jackson:jackson-jaxrs:1.9.13(runtime).
22-Mar-2017 19:46:06 19:46:06.621 [DEBUG] [org.gradle.api.internal.artifacts.ivyservice.resolveengine.graph.DependencyGraphBuilder] org.codehaus.jackson#jackson-mapper-asl is excluded from org.codehaus.jackson:jackson-jaxrs:1.9.13(runtime).
22-Mar-2017 19:46:06 19:46:06.621 [DEBUG] [org.gradle.api.internal.artifacts.ivyservice.resolveengine.graph.conflicts.DefaultConflictHandler] Selected org.codehaus.jackson:jackson-xc:1.9.13 from conflicting modules [org.codehaus.jackson:jackson-xc:1.9.13, org.codehaus.jackson:jackson-xc:1.8.3].
22-Mar-2017 19:46:06 19:46:06.621 [DEBUG] [org.gradle.api.internal.artifacts.ivyservice.resolveengine.graph.DependencyGraphBuilder] Visiting configuration org.codehaus.jackson:jackson-xc:1.9.13(compile).
22-Mar-2017 19:46:06 19:46:06.621 [DEBUG] [org.gradle.api.internal.artifacts.ivyservice.resolveengine.graph.DependencyGraphBuilder] org.codehaus.jackson#jackson-core-asl is excluded from org.codehaus.jackson:jackson-xc:1.9.13(compile).
22-Mar-2017 19:46:06 19:46:06.621 [DEBUG] [org.gradle.api.internal.artifacts.ivyservice.resolveengine.graph.DependencyGraphBuilder] org.codehaus.jackson#jackson-mapper-asl is excluded from org.codehaus.jackson:jackson-xc:1.9.13(compile).
22-Mar-2017 19:46:06 19:46:06.621 [DEBUG] [org.gradle.api.internal.artifacts.ivyservice.resolveengine.graph.DependencyGraphBuilder] Visiting configuration org.codehaus.jackson:jackson-xc:1.9.13(master).
22-Mar-2017 19:46:06 19:46:06.621 [DEBUG] [org.gradle.api.internal.artifacts.ivyservice.resolveengine.graph.DependencyGraphBuilder] Visiting configuration org.codehaus.jackson:jackson-xc:1.9.13(runtime).
22-Mar-2017 19:46:06 19:46:06.621 [DEBUG] [org.gradle.api.internal.artifacts.ivyservice.resolveengine.graph.DependencyGraphBuilder] org.codehaus.jackson#jackson-core-asl is excluded from org.codehaus.jackson:jackson-xc:1.9.13(runtime).
22-Mar-2017 19:46:06 19:46:06.621 [DEBUG] [org.gradle.api.internal.artifacts.ivyservice.resolveengine.graph.DependencyGraphBuilder] org.codehaus.jackson#jackson-mapper-asl is excluded from org.codehaus.jackson:jackson-xc:1.9.13(runtime).
22-Mar-2017 19:46:06 19:46:06.621 [DEBUG] [org.gradle.api.internal.artifacts.ivyservice.ivyresolve.RepositoryChainDependencyResolver] Attempting to resolve com.google.guava:guava:16.0.1 using repositories [MavenRepo, maven, maven2, maven3, maven4, artifactory-maven-resolver, artifactory-ivy-resolver]
22-Mar-2017 19:46:06 19:46:06.621 [DEBUG] [org.gradle.api.internal.artifacts.ivyservice.ivyresolve.RepositoryChainDependencyResolver] Using com.google.guava:guava:16.0.1 from Maven repository 'MavenRepo'
22-Mar-2017 19:46:06 19:46:06.622 [DEBUG] [org.gradle.api.internal.artifacts.ivyservice.resolveengine.graph.conflicts.DefaultConflictHandler] Selected com.google.guava:guava:16.0.1 from conflicting modules [com.google.guava:guava:11.0.2, com.google.guava:guava:16.0.1].
22-Mar-2017 19:46:06 19:46:06.622 [DEBUG] [org.gradle.api.internal.artifacts.ivyservice.resolveengine.graph.DependencyGraphBuilder] Visiting configuration com.google.guava:guava:16.0.1(compile).
22-Mar-2017 19:46:06 19:46:06.622 [DEBUG] [org.gradle.api.internal.artifacts.ivyservice.resolveengine.graph.DependencyGraphBuilder] Visiting configuration com.google.guava:guava:16.0.1(master).
22-Mar-2017 19:46:06 19:46:06.622 [DEBUG] [org.gradle.api.internal.artifacts.ivyservice.resolveengine.graph.DependencyGraphBuilder] Visiting configuration com.google.guava:guava:16.0.1(runtime).
22-Mar-2017 19:46:06 19:46:06.622 [DEBUG] [org.gradle.api.internal.artifacts.ivyservice.resolveengine.graph.conflicts.DefaultConflictHandler] Selected io.netty:netty:3.7.0.Final from conflicting modules [io.netty:netty:3.7.0.Final, io.netty:netty:3.6.2.Final].
22-Mar-2017 19:46:06 19:46:06.622 [DEBUG] [org.gradle.api.internal.artifacts.ivyservice.resolveengine.graph.DependencyGraphBuilder] Visiting configuration io.netty:netty:3.7.0.Final(compile).
22-Mar-2017 19:46:06 19:46:06.622 [DEBUG] [org.gradle.api.internal.artifacts.ivyservice.resolveengine.graph.DependencyGraphBuilder] Visiting configuration io.netty:netty:3.7.0.Final(master).
22-Mar-2017 19:46:06 19:46:06.622 [DEBUG] [org.gradle.api.internal.artifacts.ivyservice.resolveengine.graph.DependencyGraphBuilder] Visiting configuration io.netty:netty:3.7.0.Final(runtime).
22-Mar-2017 19:46:06 19:46:06.623 [DEBUG] [org.gradle.api.internal.artifacts.ivyservice.resolveengine.graph.ResolvedConfigurationDependencyGraphVisitor] Attaching org.springframework.xd:spring-xd-yarn-client:1.3.3.BUILD-SNAPSHOT(default) to its parents.
22-Mar-2017 19:46:06 19:46:06.623 [DEBUG] [org.gradle.api.internal.artifacts.ivyservice.resolveengine.graph.ResolvedConfigurationDependencyGraphVisitor] Attaching org.springframework:spring-aop:4.2.4.RELEASE(default) to its parents.
22-Mar-2017 19:46:06 19:46:06.623 [DEBUG] [org.gradle.api.internal.artifacts.ivyservice.resolveengine.graph.ResolvedConfigurationDependencyGraphVisitor] Attaching org.springframework:spring-context:4.2.4.RELEASE(default) to its parents.
22-Mar-2017 19:46:06 19:46:06.623 [DEBUG] [org.gradle.api.internal.artifacts.ivyservice.resolveengine.graph.ResolvedConfigurationDependencyGraphVisitor] Attaching org.springframework:spring-context-support:4.2.4.RELEASE(default) to its parents.
22-Mar-2017 19:46:06 19:46:06.623 [DEBUG] [org.gradle.api.internal.artifacts.ivyservice.resolveengine.graph.ResolvedConfigurationDependencyGraphVisitor] Attaching org.springframework:spring-jdbc:4.2.4.RELEASE(default) to its parents.
22-Mar-2017 19:46:06 19:46:06.624 [DEBUG] [org.gradle.api.internal.artifacts.ivyservice.resolveengine.graph.ResolvedConfigurationDependencyGraphVisitor] Attaching org.springframework:spring-tx:4.2.4.RELEASE(default) to its parents.
22-Mar-2017 19:46:06 19:46:06.624 [DEBUG] [org.gradle.api.internal.artifacts.ivyservice.resolveengine.graph.ResolvedConfigurationDependencyGraphVisitor] Attaching org.springframework.batch:spring-batch-core:3.0.5.RELEASE(default) to its parents.
22-Mar-2017 19:46:06 19:46:06.624 [DEBUG] [org.gradle.api.internal.artifacts.ivyservice.resolveengine.graph.ResolvedConfigurationDependencyGraphVisitor] Attaching org.springframework.data:spring-yarn-boot-cli:2.2.1.RELEASE(default) to its parents.
22-Mar-2017 19:46:06 19:46:06.624 [DEBUG] [org.gradle.api.internal.artifacts.ivyservice.resolveengine.graph.ResolvedConfigurationDependencyGraphVisitor] Attaching org.springframework.boot:spring-boot-autoconfigure:1.2.3.RELEASE(default) to its parents.
22-Mar-2017 19:46:06 19:46:06.624 [DEBUG] [org.gradle.api.internal.artifacts.ivyservice.resolveengine.graph.ResolvedConfigurationDependencyGraphVisitor] Attaching org.apache.zookeeper:zookeeper:3.4.6(default) to its parents.
22-Mar-2017 19:46:06 19:46:06.624 [DEBUG] [org.gradle.api.internal.artifacts.ivyservice.resolveengine.graph.ResolvedConfigurationDependencyGraphVisitor] Attaching log4j:log4j:1.2.17(default) to its parents.
22-Mar-2017 19:46:06 19:46:06.624 [DEBUG] [org.gradle.api.internal.artifacts.ivyservice.resolveengine.graph.ResolvedConfigurationDependencyGraphVisitor] Attaching org.slf4j:jcl-over-slf4j:1.7.12(default) to its parents.
22-Mar-2017 19:46:06 19:46:06.624 [DEBUG] [org.gradle.api.internal.artifacts.ivyservice.resolveengine.graph.ResolvedConfigurationDependencyGraphVisitor] Attaching org.slf4j:slf4j-log4j12:1.7.12(default) to its parents.
22-Mar-2017 19:46:06 19:46:06.624 [DEBUG] [org.gradle.api.internal.artifacts.ivyservice.resolveengine.graph.ResolvedConfigurationDependencyGraphVisitor] Attaching aopalliance:aopalliance:1.0(compile) to its parents.
22-Mar-2017 19:46:06 19:46:06.624 [DEBUG] [org.gradle.api.internal.artifacts.ivyservice.resolveengine.graph.ResolvedConfigurationDependencyGraphVisitor] Attaching aopalliance:aopalliance:1.0(master) to its parents.
22-Mar-2017 19:46:06 19:46:06.624 [DEBUG] [org.gradle.api.internal.artifacts.ivyservice.resolveengine.graph.ResolvedConfigurationDependencyGraphVisitor] Attaching aopalliance:aopalliance:1.0(runtime) to its parents.
22-Mar-2017 19:46:06 19:46:06.625 [DEBUG] [org.gradle.api.internal.artifacts.ivyservice.resolveengine.graph.ResolvedConfigurationDependencyGraphVisitor] Attaching org.springframework:spring-beans:4.2.4.RELEASE(compile) to its parents.
22-Mar-2017 19:46:06 19:46:06.625 [DEBUG] [org.gradle.api.internal.artifacts.ivyservice.resolveengine.graph.ResolvedConfigurationDependencyGraphVisitor] Attaching org.springframework:spring-beans:4.2.4.RELEASE(master) to its parents.
22-Mar-2017 19:46:06 19:46:06.625 [DEBUG] [org.gradle.api.internal.artifacts.ivyservice.resolveengine.graph.ResolvedConfigurationDependencyGraphVisitor] Attaching org.springframework:spring-beans:4.2.4.RELEASE(runtime) to its parents.
22-Mar-2017 19:46:06 19:46:06.625 [DEBUG] [org.gradle.api.internal.artifacts.ivyservice.resolveengine.graph.ResolvedConfigurationDependencyGraphVisitor] Attaching org.springframework:spring-core:4.2.4.RELEASE(compile) to its parents.
22-Mar-2017 19:46:06 19:46:06.625 [DEBUG] [org.gradle.api.internal.artifacts.ivyservice.resolveengine.graph.ResolvedConfigurationDependencyGraphVisitor] Attaching org.springframework:spring-core:4.2.4.RELEASE(master) to its parents.
22-Mar-2017 19:46:06 19:46:06.625 [DEBUG] [org.gradle.api.internal.artifacts.ivyservice.resolveengine.graph.ResolvedConfigurationDependencyGraphVisitor] Attaching org.springframework:spring-core:4.2.4.RELEASE(runtime) to its parents.
22-Mar-2017 19:46:06 19:46:06.625 [DEBUG] [org.gradle.api.internal.artifacts.ivyservice.resolveengine.graph.ResolvedConfigurationDependencyGraphVisitor] Attaching org.springframework:spring-aop:4.2.4.RELEASE(compile) to its parents.
22-Mar-2017 19:46:06 19:46:06.625 [DEBUG] [org.gradle.api.internal.artifacts.ivyservice.resolveengine.graph.ResolvedConfigurationDependencyGraphVisitor] Attaching org.springframework:spring-aop:4.2.4.RELEASE(master) to its parents.
22-Mar-2017 19:46:06 19:46:06.626 [DEBUG] [org.gradle.api.internal.artifacts.ivyservice.resolveengine.graph.ResolvedConfigurationDependencyGraphVisitor] Attaching org.springframework:spring-aop:4.2.4.RELEASE(runtime) to its parents.
22-Mar-2017 19:46:06 19:46:06.626 [DEBUG] [org.gradle.api.internal.artifacts.ivyservice.resolveengine.graph.ResolvedConfigurationDependencyGraphVisitor] Attaching org.springframework:spring-expression:4.2.4.RELEASE(compile) to its parents.
22-Mar-2017 19:46:06 19:46:06.626 [DEBUG] [org.gradle.api.internal.artifacts.ivyservice.resolveengine.graph.ResolvedConfigurationDependencyGraphVisitor] Attaching org.springframework:spring-expression:4.2.4.RELEASE(master) to its parents.
22-Mar-2017 19:46:06 19:46:06.626 [DEBUG] [org.gradle.api.internal.artifacts.ivyservice.resolveengine.graph.ResolvedConfigurationDependencyGraphVisitor] Attaching org.springframework:spring-expression:4.2.4.RELEASE(runtime) to its parents.
22-Mar-2017 19:46:06 19:46:06.626 [DEBUG] [org.gradle.api.internal.artifacts.ivyservice.resolveengine.graph.ResolvedConfigurationDependencyGraphVisitor] Attaching org.springframework:spring-context:4.2.4.RELEASE(compile) to its parents.
22-Mar-2017 19:46:06 19:46:06.626 [DEBUG] [org.gradle.api.internal.artifacts.ivyservice.resolveengine.graph.ResolvedConfigurationDependencyGraphVisitor] Attaching org.springframework:spring-context:4.2.4.RELEASE(master) to its parents.
22-Mar-2017 19:46:06 19:46:06.626 [DEBUG] [org.gradle.api.internal.artifacts.ivyservice.resolveengine.graph.ResolvedConfigurationDependencyGraphVisitor] Attaching org.springframework:spring-context:4.2.4.RELEASE(runtime) to its parents.
22-Mar-2017 19:46:06 19:46:06.626 [DEBUG] [org.gradle.api.internal.artifacts.ivyservice.resolveengine.graph.ResolvedConfigurationDependencyGraphVisitor] Attaching org.springframework:spring-tx:4.2.4.RELEASE(compile) to its parents.
22-Mar-2017 19:46:06 19:46:06.626 [DEBUG] [org.gradle.api.internal.artifacts.ivyservice.resolveengine.graph.ResolvedConfigurationDependencyGraphVisitor] Attaching org.springframework:spring-tx:4.2.4.RELEASE(master) to its parents.
22-Mar-2017 19:46:06 19:46:06.626 [DEBUG] [org.gradle.api.internal.artifacts.ivyservice.resolveengine.graph.ResolvedConfigurationDependencyGraphVisitor] Attaching org.springframework:spring-tx:4.2.4.RELEASE(runtime) to its parents.
22-Mar-2017 19:46:06 19:46:06.627 [DEBUG] [org.gradle.api.internal.artifacts.ivyservice.resolveengine.graph.ResolvedConfigurationDependencyGraphVisitor] Attaching com.ibm.jbatch:com.ibm.jbatch-tck-spi:1.0(compile) to its parents.
22-Mar-2017 19:46:06 19:46:06.627 [DEBUG] [org.gradle.api.internal.artifacts.ivyservice.resolveengine.graph.ResolvedConfigurationDependencyGraphVisitor] Attaching com.ibm.jbatch:com.ibm.jbatch-tck-spi:1.0(master) to its parents.
22-Mar-2017 19:46:06 19:46:06.627 [DEBUG] [org.gradle.api.internal.artifacts.ivyservice.resolveengine.graph.ResolvedConfigurationDependencyGraphVisitor] Attaching com.ibm.jbatch:com.ibm.jbatch-tck-spi:1.0(runtime) to its parents.
22-Mar-2017 19:46:06 19:46:06.627 [DEBUG] [org.gradle.api.internal.artifacts.ivyservice.resolveengine.graph.ResolvedConfigurationDependencyGraphVisitor] Attaching com.thoughtworks.xstream:xstream:1.4.7(compile) to its parents.
22-Mar-2017 19:46:06 19:46:06.627 [DEBUG] [org.gradle.api.internal.artifacts.ivyservice.resolveengine.graph.ResolvedConfigurationDependencyGraphVisitor] Attaching com.thoughtworks.xstream:xstream:1.4.7(master) to its parents.
22-Mar-2017 19:46:06 19:46:06.627 [DEBUG] [org.gradle.api.internal.artifacts.ivyservice.resolveengine.graph.ResolvedConfigurationDependencyGraphVisitor] Attaching com.thoughtworks.xstream:xstream:1.4.7(runtime) to its parents.
22-Mar-2017 19:46:06 19:46:06.627 [DEBUG] [org.gradle.api.internal.artifacts.ivyservice.resolveengine.graph.ResolvedConfigurationDependencyGraphVisitor] Attaching org.codehaus.jettison:jettison:1.2(compile) to its parents.
22-Mar-2017 19:46:06 19:46:06.627 [DEBUG] [org.gradle.api.internal.artifacts.ivyservice.resolveengine.graph.ResolvedConfigurationDependencyGraphVisitor] Attaching org.codehaus.jettison:jettison:1.2(master) to its parents.
22-Mar-2017 19:46:06 19:46:06.627 [DEBUG] [org.gradle.api.internal.artifacts.ivyservice.resolveengine.graph.ResolvedConfigurationDependencyGraphVisitor] Attaching org.codehaus.jettison:jettison:1.2(runtime) to its parents.
22-Mar-2017 19:46:06 19:46:06.627 [DEBUG] [org.gradle.api.internal.artifacts.ivyservice.resolveengine.graph.ResolvedConfigurationDependencyGraphVisitor] Attaching org.springframework.batch:spring-batch-infrastructure:3.0.5.RELEASE(compile) to its parents.
22-Mar-2017 19:46:06 19:46:06.627 [DEBUG] [org.gradle.api.internal.artifacts.ivyservice.resolveengine.graph.ResolvedConfigurationDependencyGraphVisitor] Attaching org.springframework.batch:spring-batch-infrastructure:3.0.5.RELEASE(master) to its parents.
22-Mar-2017 19:46:06 19:46:06.627 [DEBUG] [org.gradle.api.internal.artifacts.ivyservice.resolveengine.graph.ResolvedConfigurationDependencyGraphVisitor] Attaching org.springframework.batch:spring-batch-infrastructure:3.0.5.RELEASE(runtime) to its parents.
22-Mar-2017 19:46:06 19:46:06.627 [DEBUG] [org.gradle.api.internal.artifacts.ivyservice.resolveengine.graph.ResolvedConfigurationDependencyGraphVisitor] Attaching org.springframework.data:spring-yarn-boot:2.2.1.RELEASE(compile) to its parents.
22-Mar-2017 19:46:06 19:46:06.628 [DEBUG] [org.gradle.api.internal.artifacts.ivyservice.resolveengine.graph.ResolvedConfigurationDependencyGraphVisitor] Attaching org.springframework.data:spring-yarn-boot:2.2.1.RELEASE(master) to its parents.
22-Mar-2017 19:46:06 19:46:06.628 [DEBUG] [org.gradle.api.internal.artifacts.ivyservice.resolveengine.graph.ResolvedConfigurationDependencyGraphVisitor] Attaching org.springframework.data:spring-yarn-boot:2.2.1.RELEASE(runtime) to its parents.
22-Mar-2017 19:46:06 19:46:06.628 [DEBUG] [org.gradle.api.internal.artifacts.ivyservice.resolveengine.graph.ResolvedConfigurationDependencyGraphVisitor] Attaching org.springframework:spring-web:4.2.4.RELEASE(compile) to its parents.
22-Mar-2017 19:46:06 19:46:06.628 [DEBUG] [org.gradle.api.internal.artifacts.ivyservice.resolveengine.graph.ResolvedConfigurationDependencyGraphVisitor] Attaching org.springframework:spring-web:4.2.4.RELEASE(runtime) to its parents.
22-Mar-2017 19:46:06 19:46:06.628 [DEBUG] [org.gradle.api.internal.artifacts.ivyservice.resolveengine.graph.ResolvedConfigurationDependencyGraphVisitor] Attaching org.springframework:spring-web:4.2.4.RELEASE(master) to its parents.
22-Mar-2017 19:46:06 19:46:06.628 [DEBUG] [org.gradle.api.internal.artifacts.ivyservice.resolveengine.graph.ResolvedConfigurationDependencyGraphVisitor] Attaching org.springframework:spring-jdbc:4.2.4.RELEASE(compile) to its parents.
22-Mar-2017 19:46:06 19:46:06.628 [DEBUG] [org.gradle.api.internal.artifacts.ivyservice.resolveengine.graph.ResolvedConfigurationDependencyGraphVisitor] Attaching org.springframework:spring-jdbc:4.2.4.RELEASE(master) to its parents.
22-Mar-2017 19:46:06 19:46:06.628 [DEBUG] [org.gradle.api.internal.artifacts.ivyservice.resolveengine.graph.ResolvedConfigurationDependencyGraphVisitor] Attaching org.springframework:spring-jdbc:4.2.4.RELEASE(runtime) to its parents.
22-Mar-2017 19:46:06 19:46:06.628 [DEBUG] [org.gradle.api.internal.artifacts.ivyservice.resolveengine.graph.ResolvedConfigurationDependencyGraphVisitor] Attaching org.springframework.boot:spring-boot-cli:1.2.3.RELEASE(compile) to its parents.
22-Mar-2017 19:46:06 19:46:06.628 [DEBUG] [org.gradle.api.internal.artifacts.ivyservice.resolveengine.graph.ResolvedConfigurationDependencyGraphVisitor] Attaching org.springframework.boot:spring-boot-cli:1.2.3.RELEASE(master) to its parents.
22-Mar-2017 19:46:06 19:46:06.628 [DEBUG] [org.gradle.api.internal.artifacts.ivyservice.resolveengine.graph.ResolvedConfigurationDependencyGraphVisitor] Attaching org.springframework.boot:spring-boot-cli:1.2.3.RELEASE(runtime) to its parents.
22-Mar-2017 19:46:06 19:46:06.628 [DEBUG] [org.gradle.api.internal.artifacts.ivyservice.resolveengine.graph.ResolvedConfigurationDependencyGraphVisitor] Attaching org.springframework:spring-context-support:4.2.4.RELEASE(compile) to its parents.
22-Mar-2017 19:46:06 19:46:06.629 [DEBUG] [org.gradle.api.internal.artifacts.ivyservice.resolveengine.graph.ResolvedConfigurationDependencyGraphVisitor] Attaching org.springframework:spring-context-support:4.2.4.RELEASE(master) to its parents.
22-Mar-2017 19:46:06 19:46:06.629 [DEBUG] [org.gradle.api.internal.artifacts.ivyservice.resolveengine.graph.ResolvedConfigurationDependencyGraphVisitor] Attaching org.springframework:spring-context-support:4.2.4.RELEASE(runtime) to its parents.
22-Mar-2017 19:46:06 19:46:06.629 [DEBUG] [org.gradle.api.internal.artifacts.ivyservice.resolveengine.graph.ResolvedConfigurationDependencyGraphVisitor] Attaching org.springframework.boot:spring-boot:1.2.3.RELEASE(compile) to its parents.
22-Mar-2017 19:46:06 19:46:06.629 [DEBUG] [org.gradle.api.internal.artifacts.ivyservice.resolveengine.graph.ResolvedConfigurationDependencyGraphVisitor] Attaching org.springframework.boot:spring-boot:1.2.3.RELEASE(master) to its parents.
22-Mar-2017 19:46:06 19:46:06.629 [DEBUG] [org.gradle.api.internal.artifacts.ivyservice.resolveengine.graph.ResolvedConfigurationDependencyGraphVisitor] Attaching org.springframework.boot:spring-boot:1.2.3.RELEASE(runtime) to its parents.
22-Mar-2017 19:46:06 19:46:06.629 [DEBUG] [org.gradle.api.internal.artifacts.ivyservice.resolveengine.graph.ResolvedConfigurationDependencyGraphVisitor] Attaching org.yaml:snakeyaml:1.14(compile) to its parents.
22-Mar-2017 19:46:06 19:46:06.629 [DEBUG] [org.gradle.api.internal.artifacts.ivyservice.resolveengine.graph.ResolvedConfigurationDependencyGraphVisitor] Attaching org.yaml:snakeyaml:1.14(master) to its parents.
22-Mar-2017 19:46:06 19:46:06.629 [DEBUG] [org.gradle.api.internal.artifacts.ivyservice.resolveengine.graph.ResolvedConfigurationDependencyGraphVisitor] Attaching org.yaml:snakeyaml:1.14(runtime) to its parents.
22-Mar-2017 19:46:06 19:46:06.629 [DEBUG] [org.gradle.api.internal.artifacts.ivyservice.resolveengine.graph.ResolvedConfigurationDependencyGraphVisitor] Attaching org.slf4j:slf4j-api:1.7.12(compile) to its parents.
22-Mar-2017 19:46:06 19:46:06.629 [DEBUG] [org.gradle.api.internal.artifacts.ivyservice.resolveengine.graph.ResolvedConfigurationDependencyGraphVisitor] Attaching org.slf4j:slf4j-api:1.7.12(master) to its parents.
22-Mar-2017 19:46:06 19:46:06.629 [DEBUG] [org.gradle.api.internal.artifacts.ivyservice.resolveengine.graph.ResolvedConfigurationDependencyGraphVisitor] Attaching org.slf4j:slf4j-api:1.7.12(runtime) to its parents.
22-Mar-2017 19:46:06 19:46:06.630 [DEBUG] [org.gradle.api.internal.artifacts.ivyservice.resolveengine.graph.ResolvedConfigurationDependencyGraphVisitor] Attaching org.slf4j:slf4j-log4j12:1.7.12(compile) to its parents.
22-Mar-2017 19:46:06 19:46:06.630 [DEBUG] [org.gradle.api.internal.artifacts.ivyservice.resolveengine.graph.ResolvedConfigurationDependencyGraphVisitor] Attaching org.slf4j:slf4j-log4j12:1.7.12(master) to its parents.
22-Mar-2017 19:46:06 19:46:06.630 [DEBUG] [org.gradle.api.internal.artifacts.ivyservice.resolveengine.graph.ResolvedConfigurationDependencyGraphVisitor] Attaching org.slf4j:slf4j-log4j12:1.7.12(runtime) to its parents.
22-Mar-2017 19:46:06 19:46:06.630 [DEBUG] [org.gradle.api.internal.artifacts.ivyservice.resolveengine.graph.ResolvedConfigurationDependencyGraphVisitor] Attaching log4j:log4j:1.2.17(compile) to its parents.
22-Mar-2017 19:46:06 19:46:06.630 [DEBUG] [org.gradle.api.internal.artifacts.ivyservice.resolveengine.graph.ResolvedConfigurationDependencyGraphVisitor] Attaching log4j:log4j:1.2.17(master) to its parents.
22-Mar-2017 19:46:06 19:46:06.630 [DEBUG] [org.gradle.api.internal.artifacts.ivyservice.resolveengine.graph.ResolvedConfigurationDependencyGraphVisitor] Attaching log4j:log4j:1.2.17(runtime) to its parents.
22-Mar-2017 19:46:06 19:46:06.630 [DEBUG] [org.gradle.api.internal.artifacts.ivyservice.resolveengine.graph.ResolvedConfigurationDependencyGraphVisitor] Attaching io.netty:netty:3.7.0.Final(compile) to its parents.
22-Mar-2017 19:46:06 19:46:06.630 [DEBUG] [org.gradle.api.internal.artifacts.ivyservice.resolveengine.graph.ResolvedConfigurationDependencyGraphVisitor] Attaching io.netty:netty:3.7.0.Final(master) to its parents.
22-Mar-2017 19:46:06 19:46:06.630 [DEBUG] [org.gradle.api.internal.artifacts.ivyservice.resolveengine.graph.ResolvedConfigurationDependencyGraphVisitor] Attaching io.netty:netty:3.7.0.Final(runtime) to its parents.
22-Mar-2017 19:46:06 19:46:06.630 [DEBUG] [org.gradle.api.internal.artifacts.ivyservice.resolveengine.graph.ResolvedConfigurationDependencyGraphVisitor] Attaching commons-logging:commons-logging:1.2(compile) to its parents.
22-Mar-2017 19:46:06 19:46:06.630 [DEBUG] [org.gradle.api.internal.artifacts.ivyservice.resolveengine.graph.ResolvedConfigurationDependencyGraphVisitor] Attaching commons-logging:commons-logging:1.2(master) to its parents.
22-Mar-2017 19:46:06 19:46:06.630 [DEBUG] [org.gradle.api.internal.artifacts.ivyservice.resolveengine.graph.ResolvedConfigurationDependencyGraphVisitor] Attaching commons-logging:commons-logging:1.2(runtime) to its parents.
22-Mar-2017 19:46:06 19:46:06.631 [DEBUG] [org.gradle.api.internal.artifacts.ivyservice.resolveengine.graph.ResolvedConfigurationDependencyGraphVisitor] Attaching javax.batch:javax.batch-api:1.0(compile) to its parents.
22-Mar-2017 19:46:06 19:46:06.631 [DEBUG] [org.gradle.api.internal.artifacts.ivyservice.resolveengine.graph.ResolvedConfigurationDependencyGraphVisitor] Attaching javax.batch:javax.batch-api:1.0(master) to its parents.
22-Mar-2017 19:46:06 19:46:06.631 [DEBUG] [org.gradle.api.internal.artifacts.ivyservice.resolveengine.graph.ResolvedConfigurationDependencyGraphVisitor] Attaching javax.batch:javax.batch-api:1.0(runtime) to its parents.
22-Mar-2017 19:46:06 19:46:06.631 [DEBUG] [org.gradle.api.internal.artifacts.ivyservice.resolveengine.graph.ResolvedConfigurationDependencyGraphVisitor] Attaching xmlpull:xmlpull:1.1.3.1(compile) to its parents.
22-Mar-2017 19:46:06 19:46:06.631 [DEBUG] [org.gradle.api.internal.artifacts.ivyservice.resolveengine.graph.ResolvedConfigurationDependencyGraphVisitor] Attaching xmlpull:xmlpull:1.1.3.1(master) to its parents.
22-Mar-2017 19:46:06 19:46:06.631 [DEBUG] [org.gradle.api.internal.artifacts.ivyservice.resolveengine.graph.ResolvedConfigurationDependencyGraphVisitor] Attaching xpp3:xpp3_min:1.1.4c(compile) to its parents.
22-Mar-2017 19:46:06 19:46:06.631 [DEBUG] [org.gradle.api.internal.artifacts.ivyservice.resolveengine.graph.ResolvedConfigurationDependencyGraphVisitor] Attaching xpp3:xpp3_min:1.1.4c(master) to its parents.
22-Mar-2017 19:46:06 19:46:06.631 [DEBUG] [org.gradle.api.internal.artifacts.ivyservice.resolveengine.graph.ResolvedConfigurationDependencyGraphVisitor] Attaching xmlpull:xmlpull:1.1.3.1(runtime) to its parents.
22-Mar-2017 19:46:06 19:46:06.631 [DEBUG] [org.gradle.api.internal.artifacts.ivyservice.resolveengine.graph.ResolvedConfigurationDependencyGraphVisitor] Attaching xpp3:xpp3_min:1.1.4c(runtime) to its parents.
22-Mar-2017 19:46:06 19:46:06.631 [DEBUG] [org.gradle.api.internal.artifacts.ivyservice.resolveengine.graph.ResolvedConfigurationDependencyGraphVisitor] Attaching org.springframework.retry:spring-retry:1.1.2.RELEASE(compile) to its parents.
22-Mar-2017 19:46:06 19:46:06.631 [DEBUG] [org.gradle.api.internal.artifacts.ivyservice.resolveengine.graph.ResolvedConfigurationDependencyGraphVisitor] Attaching org.springframework.retry:spring-retry:1.1.2.RELEASE(master) to its parents.
22-Mar-2017 19:46:06 19:46:06.631 [DEBUG] [org.gradle.api.internal.artifacts.ivyservice.resolveengine.graph.ResolvedConfigurationDependencyGraphVisitor] Attaching org.springframework.retry:spring-retry:1.1.2.RELEASE(runtime) to its parents.
22-Mar-2017 19:46:06 19:46:06.631 [DEBUG] [org.gradle.api.internal.artifacts.ivyservice.resolveengine.graph.ResolvedConfigurationDependencyGraphVisitor] Attaching org.springframework.boot:spring-boot-autoconfigure:1.2.3.RELEASE(compile) to its parents.
22-Mar-2017 19:46:06 19:46:06.631 [DEBUG] [org.gradle.api.internal.artifacts.ivyservice.resolveengine.graph.ResolvedConfigurationDependencyGraphVisitor] Attaching org.springframework.boot:spring-boot-autoconfigure:1.2.3.RELEASE(master) to its parents.
22-Mar-2017 19:46:06 19:46:06.631 [DEBUG] [org.gradle.api.internal.artifacts.ivyservice.resolveengine.graph.ResolvedConfigurationDependencyGraphVisitor] Attaching org.springframework.data:spring-yarn-core:2.2.1.RELEASE(compile) to its parents.
22-Mar-2017 19:46:06 19:46:06.632 [DEBUG] [org.gradle.api.internal.artifacts.ivyservice.resolveengine.graph.ResolvedConfigurationDependencyGraphVisitor] Attaching org.springframework.data:spring-yarn-core:2.2.1.RELEASE(master) to its parents.
22-Mar-2017 19:46:06 19:46:06.632 [DEBUG] [org.gradle.api.internal.artifacts.ivyservice.resolveengine.graph.ResolvedConfigurationDependencyGraphVisitor] Attaching org.springframework.boot:spring-boot-actuator:1.2.3.RELEASE(compile) to its parents.
22-Mar-2017 19:46:06 19:46:06.632 [DEBUG] [org.gradle.api.internal.artifacts.ivyservice.resolveengine.graph.ResolvedConfigurationDependencyGraphVisitor] Attaching org.springframework.boot:spring-boot-actuator:1.2.3.RELEASE(master) to its parents.
22-Mar-2017 19:46:06 19:46:06.632 [DEBUG] [org.gradle.api.internal.artifacts.ivyservice.resolveengine.graph.ResolvedConfigurationDependencyGraphVisitor] Attaching org.apache.httpcomponents:httpclient:4.5(compile) to its parents.
22-Mar-2017 19:46:06 19:46:06.632 [DEBUG] [org.gradle.api.internal.artifacts.ivyservice.resolveengine.graph.ResolvedConfigurationDependencyGraphVisitor] Attaching org.apache.httpcomponents:httpclient:4.5(master) to its parents.
22-Mar-2017 19:46:06 19:46:06.632 [DEBUG] [org.gradle.api.internal.artifacts.ivyservice.resolveengine.graph.ResolvedConfigurationDependencyGraphVisitor] Attaching org.springframework.boot:spring-boot-autoconfigure:1.2.3.RELEASE(runtime) to its parents.
22-Mar-2017 19:46:06 19:46:06.632 [DEBUG] [org.gradle.api.internal.artifacts.ivyservice.resolveengine.graph.ResolvedConfigurationDependencyGraphVisitor] Attaching org.springframework.data:spring-yarn-core:2.2.1.RELEASE(runtime) to its parents.
22-Mar-2017 19:46:06 19:46:06.632 [DEBUG] [org.gradle.api.internal.artifacts.ivyservice.resolveengine.graph.ResolvedConfigurationDependencyGraphVisitor] Attaching org.springframework.boot:spring-boot-actuator:1.2.3.RELEASE(runtime) to its parents.
22-Mar-2017 19:46:06 19:46:06.632 [DEBUG] [org.gradle.api.internal.artifacts.ivyservice.resolveengine.graph.ResolvedConfigurationDependencyGraphVisitor] Attaching org.apache.httpcomponents:httpclient:4.5(runtime) to its parents.
22-Mar-2017 19:46:06 19:46:06.632 [DEBUG] [org.gradle.api.internal.artifacts.ivyservice.resolveengine.graph.ResolvedConfigurationDependencyGraphVisitor] Attaching org.springframework.boot:spring-boot-dependency-tools:1.2.3.RELEASE(compile) to its parents.
22-Mar-2017 19:46:06 19:46:06.632 [DEBUG] [org.gradle.api.internal.artifacts.ivyservice.resolveengine.graph.ResolvedConfigurationDependencyGraphVisitor] Attaching org.springframework.boot:spring-boot-dependency-tools:1.2.3.RELEASE(master) to its parents.
22-Mar-2017 19:46:06 19:46:06.632 [DEBUG] [org.gradle.api.internal.artifacts.ivyservice.resolveengine.graph.ResolvedConfigurationDependencyGraphVisitor] Attaching org.springframework.boot:spring-boot-loader-tools:1.2.3.RELEASE(compile) to its parents.
22-Mar-2017 19:46:06 19:46:06.632 [DEBUG] [org.gradle.api.internal.artifacts.ivyservice.resolveengine.graph.ResolvedConfigurationDependencyGraphVisitor] Attaching org.springframework.boot:spring-boot-loader-tools:1.2.3.RELEASE(master) to its parents.
22-Mar-2017 19:46:06 19:46:06.633 [DEBUG] [org.gradle.api.internal.artifacts.ivyservice.resolveengine.graph.ResolvedConfigurationDependencyGraphVisitor] Attaching jline:jline:2.11(compile) to its parents.
22-Mar-2017 19:46:06 19:46:06.633 [DEBUG] [org.gradle.api.internal.artifacts.ivyservice.resolveengine.graph.ResolvedConfigurationDependencyGraphVisitor] Attaching jline:jline:2.11(master) to its parents.
22-Mar-2017 19:46:06 19:46:06.633 [DEBUG] [org.gradle.api.internal.artifacts.ivyservice.resolveengine.graph.ResolvedConfigurationDependencyGraphVisitor] Attaching net.sf.jopt-simple:jopt-simple:4.6(compile) to its parents.
22-Mar-2017 19:46:06 19:46:06.633 [DEBUG] [org.gradle.api.internal.artifacts.ivyservice.resolveengine.graph.ResolvedConfigurationDependencyGraphVisitor] Attaching net.sf.jopt-simple:jopt-simple:4.6(master) to its parents.
22-Mar-2017 19:46:06 19:46:06.633 [DEBUG] [org.gradle.api.internal.artifacts.ivyservice.resolveengine.graph.ResolvedConfigurationDependencyGraphVisitor] Attaching org.codehaus.groovy:groovy:2.4.4(compile) to its parents.
22-Mar-2017 19:46:06 19:46:06.633 [DEBUG] [org.gradle.api.internal.artifacts.ivyservice.resolveengine.graph.ResolvedConfigurationDependencyGraphVisitor] Attaching org.codehaus.groovy:groovy:2.4.4(master) to its parents.
22-Mar-2017 19:46:06 19:46:06.633 [DEBUG] [org.gradle.api.internal.artifacts.ivyservice.resolveengine.graph.ResolvedConfigurationDependencyGraphVisitor] Attaching org.json:json:20140107(compile) to its parents.
22-Mar-2017 19:46:06 19:46:06.633 [DEBUG] [org.gradle.api.internal.artifacts.ivyservice.resolveengine.graph.ResolvedConfigurationDependencyGraphVisitor] Attaching org.json:json:20140107(master) to its parents.
22-Mar-2017 19:46:06 19:46:06.633 [DEBUG] [org.gradle.api.internal.artifacts.ivyservice.resolveengine.graph.ResolvedConfigurationDependencyGraphVisitor] Attaching org.apache.maven:maven-aether-provider:3.2.1(compile) to its parents.
22-Mar-2017 19:46:06 19:46:06.633 [DEBUG] [org.gradle.api.internal.artifacts.ivyservice.resolveengine.graph.ResolvedConfigurationDependencyGraphVisitor] Attaching org.apache.maven:maven-aether-provider:3.2.1(master) to its parents.
22-Mar-2017 19:46:06 19:46:06.633 [DEBUG] [org.gradle.api.internal.artifacts.ivyservice.resolveengine.graph.ResolvedConfigurationDependencyGraphVisitor] Attaching org.apache.maven:maven-settings-builder:3.1.1(compile) to its parents.
22-Mar-2017 19:46:06 19:46:06.633 [DEBUG] [org.gradle.api.internal.artifacts.ivyservice.resolveengine.graph.ResolvedConfigurationDependencyGraphVisitor] Attaching org.apache.maven:maven-settings-builder:3.1.1(master) to its parents.
22-Mar-2017 19:46:06 19:46:06.633 [DEBUG] [org.gradle.api.internal.artifacts.ivyservice.resolveengine.graph.ResolvedConfigurationDependencyGraphVisitor] Attaching org.codehaus.plexus:plexus-component-api:1.0-alpha-33(compile) to its parents.
22-Mar-2017 19:46:06 19:46:06.633 [DEBUG] [org.gradle.api.internal.artifacts.ivyservice.resolveengine.graph.ResolvedConfigurationDependencyGraphVisitor] Attaching org.codehaus.plexus:plexus-component-api:1.0-alpha-33(master) to its parents.
22-Mar-2017 19:46:06 19:46:06.634 [DEBUG] [org.gradle.api.internal.artifacts.ivyservice.resolveengine.graph.ResolvedConfigurationDependencyGraphVisitor] Attaching org.eclipse.aether:aether-api:0.9.1.v20140329(compile) to its parents.
22-Mar-2017 19:46:06 19:46:06.634 [DEBUG] [org.gradle.api.internal.artifacts.ivyservice.resolveengine.graph.ResolvedConfigurationDependencyGraphVisitor] Attaching org.eclipse.aether:aether-api:0.9.1.v20140329(master) to its parents.
22-Mar-2017 19:46:06 19:46:06.634 [DEBUG] [org.gradle.api.internal.artifacts.ivyservice.resolveengine.graph.ResolvedConfigurationDependencyGraphVisitor] Attaching org.eclipse.aether:aether-connector-basic:0.9.1.v20140329(compile) to its parents.
22-Mar-2017 19:46:06 19:46:06.634 [DEBUG] [org.gradle.api.internal.artifacts.ivyservice.resolveengine.graph.ResolvedConfigurationDependencyGraphVisitor] Attaching org.eclipse.aether:aether-connector-basic:0.9.1.v20140329(master) to its parents.
22-Mar-2017 19:46:06 19:46:06.634 [DEBUG] [org.gradle.api.internal.artifacts.ivyservice.resolveengine.graph.ResolvedConfigurationDependencyGraphVisitor] Attaching org.eclipse.aether:aether-impl:0.9.1.v20140329(compile) to its parents.
22-Mar-2017 19:46:06 19:46:06.634 [DEBUG] [org.gradle.api.internal.artifacts.ivyservice.resolveengine.graph.ResolvedConfigurationDependencyGraphVisitor] Attaching org.eclipse.aether:aether-impl:0.9.1.v20140329(master) to its parents.
22-Mar-2017 19:46:06 19:46:06.634 [DEBUG] [org.gradle.api.internal.artifacts.ivyservice.resolveengine.graph.ResolvedConfigurationDependencyGraphVisitor] Attaching org.eclipse.aether:aether-spi:0.9.1.v20140329(compile) to its parents.
22-Mar-2017 19:46:06 19:46:06.634 [DEBUG] [org.gradle.api.internal.artifacts.ivyservice.resolveengine.graph.ResolvedConfigurationDependencyGraphVisitor] Attaching org.eclipse.aether:aether-spi:0.9.1.v20140329(master) to its parents.
22-Mar-2017 19:46:06 19:46:06.634 [DEBUG] [org.gradle.api.internal.artifacts.ivyservice.resolveengine.graph.ResolvedConfigurationDependencyGraphVisitor] Attaching org.eclipse.aether:aether-transport-file:0.9.1.v20140329(compile) to its parents.
22-Mar-2017 19:46:06 19:46:06.634 [DEBUG] [org.gradle.api.internal.artifacts.ivyservice.resolveengine.graph.ResolvedConfigurationDependencyGraphVisitor] Attaching org.eclipse.aether:aether-transport-file:0.9.1.v20140329(master) to its parents.
22-Mar-2017 19:46:06 19:46:06.634 [DEBUG] [org.gradle.api.internal.artifacts.ivyservice.resolveengine.graph.ResolvedConfigurationDependencyGraphVisitor] Attaching org.eclipse.aether:aether-transport-http:0.9.1.v20140329(compile) to its parents.
22-Mar-2017 19:46:06 19:46:06.634 [DEBUG] [org.gradle.api.internal.artifacts.ivyservice.resolveengine.graph.ResolvedConfigurationDependencyGraphVisitor] Attaching org.eclipse.aether:aether-transport-http:0.9.1.v20140329(master) to its parents.
22-Mar-2017 19:46:06 19:46:06.634 [DEBUG] [org.gradle.api.internal.artifacts.ivyservice.resolveengine.graph.ResolvedConfigurationDependencyGraphVisitor] Attaching org.eclipse.aether:aether-util:0.9.1.v20140329(compile) to its parents.
22-Mar-2017 19:46:06 19:46:06.635 [DEBUG] [org.gradle.api.internal.artifacts.ivyservice.resolveengine.graph.ResolvedConfigurationDependencyGraphVisitor] Attaching org.eclipse.aether:aether-util:0.9.1.v20140329(master) to its parents.
22-Mar-2017 19:46:06 19:46:06.635 [DEBUG] [org.gradle.api.internal.artifacts.ivyservice.resolveengine.graph.ResolvedConfigurationDependencyGraphVisitor] Attaching org.springframework.boot:spring-boot-dependency-tools:1.2.3.RELEASE(runtime) to its parents.
22-Mar-2017 19:46:06 19:46:06.635 [DEBUG] [org.gradle.api.internal.artifacts.ivyservice.resolveengine.graph.ResolvedConfigurationDependencyGraphVisitor] Attaching org.springframework.boot:spring-boot-loader-tools:1.2.3.RELEASE(runtime) to its parents.
22-Mar-2017 19:46:06 19:46:06.635 [DEBUG] [org.gradle.api.internal.artifacts.ivyservice.resolveengine.graph.ResolvedConfigurationDependencyGraphVisitor] Attaching jline:jline:2.11(runtime) to its parents.
22-Mar-2017 19:46:06 19:46:06.635 [DEBUG] [org.gradle.api.internal.artifacts.ivyservice.resolveengine.graph.ResolvedConfigurationDependencyGraphVisitor] Attaching net.sf.jopt-simple:jopt-simple:4.6(runtime) to its parents.
22-Mar-2017 19:46:06 19:46:06.635 [DEBUG] [org.gradle.api.internal.artifacts.ivyservice.resolveengine.graph.ResolvedConfigurationDependencyGraphVisitor] Attaching org.codehaus.groovy:groovy:2.4.4(runtime) to its parents.
22-Mar-2017 19:46:06 19:46:06.635 [DEBUG] [org.gradle.api.internal.artifacts.ivyservice.resolveengine.graph.ResolvedConfigurationDependencyGraphVisitor] Attaching org.json:json:20140107(runtime) to its parents.
22-Mar-2017 19:46:06 19:46:06.635 [DEBUG] [org.gradle.api.internal.artifacts.ivyservice.resolveengine.graph.ResolvedConfigurationDependencyGraphVisitor] Attaching org.apache.maven:maven-aether-provider:3.2.1(runtime) to its parents.
22-Mar-2017 19:46:06 19:46:06.635 [DEBUG] [org.gradle.api.internal.artifacts.ivyservice.resolveengine.graph.ResolvedConfigurationDependencyGraphVisitor] Attaching org.apache.maven:maven-settings-builder:3.1.1(runtime) to its parents.
22-Mar-2017 19:46:06 19:46:06.635 [DEBUG] [org.gradle.api.internal.artifacts.ivyservice.resolveengine.graph.ResolvedConfigurationDependencyGraphVisitor] Attaching org.codehaus.plexus:plexus-component-api:1.0-alpha-33(runtime) to its parents.
22-Mar-2017 19:46:06 19:46:06.635 [DEBUG] [org.gradle.api.internal.artifacts.ivyservice.resolveengine.graph.ResolvedConfigurationDependencyGraphVisitor] Attaching org.eclipse.aether:aether-api:0.9.1.v20140329(runtime) to its parents.
22-Mar-2017 19:46:06 19:46:06.635 [DEBUG] [org.gradle.api.internal.artifacts.ivyservice.resolveengine.graph.ResolvedConfigurationDependencyGraphVisitor] Attaching org.eclipse.aether:aether-connector-basic:0.9.1.v20140329(runtime) to its parents.
22-Mar-2017 19:46:06 19:46:06.635 [DEBUG] [org.gradle.api.internal.artifacts.ivyservice.resolveengine.graph.ResolvedConfigurationDependencyGraphVisitor] Attaching org.eclipse.aether:aether-impl:0.9.1.v20140329(runtime) to its parents.
22-Mar-2017 19:46:06 19:46:06.636 [DEBUG] [org.gradle.api.internal.artifacts.ivyservice.resolveengine.graph.ResolvedConfigurationDependencyGraphVisitor] Attaching org.eclipse.aether:aether-spi:0.9.1.v20140329(runtime) to its parents.
22-Mar-2017 19:46:06 19:46:06.636 [DEBUG] [org.gradle.api.internal.artifacts.ivyservice.resolveengine.graph.ResolvedConfigurationDependencyGraphVisitor] Attaching org.eclipse.aether:aether-transport-file:0.9.1.v20140329(runtime) to its parents.
22-Mar-2017 19:46:06 19:46:06.636 [DEBUG] [org.gradle.api.internal.artifacts.ivyservice.resolveengine.graph.ResolvedConfigurationDependencyGraphVisitor] Attaching org.eclipse.aether:aether-transport-http:0.9.1.v20140329(runtime) to its parents.
22-Mar-2017 19:46:06 19:46:06.636 [DEBUG] [org.gradle.api.internal.artifacts.ivyservice.resolveengine.graph.ResolvedConfigurationDependencyGraphVisitor] Attaching org.eclipse.aether:aether-util:0.9.1.v20140329(runtime) to its parents.
22-Mar-2017 19:46:06 19:46:06.636 [DEBUG] [org.gradle.api.internal.artifacts.ivyservice.resolveengine.graph.ResolvedConfigurationDependencyGraphVisitor] Attaching org.apache.hadoop:hadoop-yarn-client:2.7.1(compile) to its parents.
22-Mar-2017 19:46:06 19:46:06.636 [DEBUG] [org.gradle.api.internal.artifacts.ivyservice.resolveengine.graph.ResolvedConfigurationDependencyGraphVisitor] Attaching org.apache.hadoop:hadoop-yarn-client:2.7.1(master) to its parents.
22-Mar-2017 19:46:06 19:46:06.636 [DEBUG] [org.gradle.api.internal.artifacts.ivyservice.resolveengine.graph.ResolvedConfigurationDependencyGraphVisitor] Attaching org.apache.hadoop:hadoop-common:2.7.1(compile) to its parents.
22-Mar-2017 19:46:06 19:46:06.636 [DEBUG] [org.gradle.api.internal.artifacts.ivyservice.resolveengine.graph.ResolvedConfigurationDependencyGraphVisitor] Attaching org.apache.hadoop:hadoop-common:2.7.1(master) to its parents.
22-Mar-2017 19:46:06 19:46:06.636 [DEBUG] [org.gradle.api.internal.artifacts.ivyservice.resolveengine.graph.ResolvedConfigurationDependencyGraphVisitor] Attaching org.springframework.data:spring-data-hadoop:2.2.1.RELEASE(compile) to its parents.
22-Mar-2017 19:46:06 19:46:06.636 [DEBUG] [org.gradle.api.internal.artifacts.ivyservice.resolveengine.graph.ResolvedConfigurationDependencyGraphVisitor] Attaching org.springframework.data:spring-data-hadoop:2.2.1.RELEASE(master) to its parents.
22-Mar-2017 19:46:06 19:46:06.636 [DEBUG] [org.gradle.api.internal.artifacts.ivyservice.resolveengine.graph.ResolvedConfigurationDependencyGraphVisitor] Attaching org.springframework:spring-messaging:4.2.4.RELEASE(compile) to its parents.
22-Mar-2017 19:46:06 19:46:06.636 [DEBUG] [org.gradle.api.internal.artifacts.ivyservice.resolveengine.graph.ResolvedConfigurationDependencyGraphVisitor] Attaching org.springframework:spring-messaging:4.2.4.RELEASE(master) to its parents.
22-Mar-2017 19:46:06 19:46:06.637 [DEBUG] [org.gradle.api.internal.artifacts.ivyservice.resolveengine.graph.ResolvedConfigurationDependencyGraphVisitor] Attaching com.fasterxml.jackson.core:jackson-databind:2.4.5(compile) to its parents.
22-Mar-2017 19:46:06 19:46:06.637 [DEBUG] [org.gradle.api.internal.artifacts.ivyservice.resolveengine.graph.ResolvedConfigurationDependencyGraphVisitor] Attaching com.fasterxml.jackson.core:jackson-databind:2.4.5(master) to its parents.
22-Mar-2017 19:46:06 19:46:06.637 [DEBUG] [org.gradle.api.internal.artifacts.ivyservice.resolveengine.graph.ResolvedConfigurationDependencyGraphVisitor] Attaching org.apache.httpcomponents:httpcore:4.4.1(compile) to its parents.
22-Mar-2017 19:46:06 19:46:06.637 [DEBUG] [org.gradle.api.internal.artifacts.ivyservice.resolveengine.graph.ResolvedConfigurationDependencyGraphVisitor] Attaching org.apache.httpcomponents:httpcore:4.4.1(master) to its parents.
22-Mar-2017 19:46:06 19:46:06.637 [DEBUG] [org.gradle.api.internal.artifacts.ivyservice.resolveengine.graph.ResolvedConfigurationDependencyGraphVisitor] Attaching commons-codec:commons-codec:1.7(compile) to its parents.
22-Mar-2017 19:46:06 19:46:06.637 [DEBUG] [org.gradle.api.internal.artifacts.ivyservice.resolveengine.graph.ResolvedConfigurationDependencyGraphVisitor] Attaching commons-codec:commons-codec:1.7(master) to its parents.
22-Mar-2017 19:46:06 19:46:06.637 [DEBUG] [org.gradle.api.internal.artifacts.ivyservice.resolveengine.graph.ResolvedConfigurationDependencyGraphVisitor] Attaching org.apache.hadoop:hadoop-yarn-client:2.7.1(runtime) to its parents.
22-Mar-2017 19:46:06 19:46:06.637 [DEBUG] [org.gradle.api.internal.artifacts.ivyservice.resolveengine.graph.ResolvedConfigurationDependencyGraphVisitor] Attaching org.apache.hadoop:hadoop-common:2.7.1(runtime) to its parents.
22-Mar-2017 19:46:06 19:46:06.637 [DEBUG] [org.gradle.api.internal.artifacts.ivyservice.resolveengine.graph.ResolvedConfigurationDependencyGraphVisitor] Attaching org.springframework.data:spring-data-hadoop:2.2.1.RELEASE(runtime) to its parents.
22-Mar-2017 19:46:06 19:46:06.637 [DEBUG] [org.gradle.api.internal.artifacts.ivyservice.resolveengine.graph.ResolvedConfigurationDependencyGraphVisitor] Attaching org.springframework:spring-messaging:4.2.4.RELEASE(runtime) to its parents.
22-Mar-2017 19:46:06 19:46:06.637 [DEBUG] [org.gradle.api.internal.artifacts.ivyservice.resolveengine.graph.ResolvedConfigurationDependencyGraphVisitor] Attaching com.fasterxml.jackson.core:jackson-databind:2.4.5(runtime) to its parents.
22-Mar-2017 19:46:06 19:46:06.637 [DEBUG] [org.gradle.api.internal.artifacts.ivyservice.resolveengine.graph.ResolvedConfigurationDependencyGraphVisitor] Attaching org.apache.httpcomponents:httpcore:4.4.1(runtime) to its parents.
22-Mar-2017 19:46:06 19:46:06.638 [DEBUG] [org.gradle.api.internal.artifacts.ivyservice.resolveengine.graph.ResolvedConfigurationDependencyGraphVisitor] Attaching commons-codec:commons-codec:1.7(runtime) to its parents.
22-Mar-2017 19:46:06 19:46:06.638 [DEBUG] [org.gradle.api.internal.artifacts.ivyservice.resolveengine.graph.ResolvedConfigurationDependencyGraphVisitor] Attaching org.apache.maven:maven-model:3.2.1(compile) to its parents.
22-Mar-2017 19:46:06 19:46:06.638 [DEBUG] [org.gradle.api.internal.artifacts.ivyservice.resolveengine.graph.ResolvedConfigurationDependencyGraphVisitor] Attaching org.apache.maven:maven-model:3.2.1(master) to its parents.
22-Mar-2017 19:46:06 19:46:06.638 [DEBUG] [org.gradle.api.internal.artifacts.ivyservice.resolveengine.graph.ResolvedConfigurationDependencyGraphVisitor] Attaching org.apache.maven:maven-model-builder:3.2.1(compile) to its parents.
22-Mar-2017 19:46:06 19:46:06.638 [DEBUG] [org.gradle.api.internal.artifacts.ivyservice.resolveengine.graph.ResolvedConfigurationDependencyGraphVisitor] Attaching org.apache.maven:maven-model-builder:3.2.1(master) to its parents.
22-Mar-2017 19:46:06 19:46:06.638 [DEBUG] [org.gradle.api.internal.artifacts.ivyservice.resolveengine.graph.ResolvedConfigurationDependencyGraphVisitor] Attaching org.apache.maven:maven-repository-metadata:3.2.1(compile) to its parents.
22-Mar-2017 19:46:06 19:46:06.638 [DEBUG] [org.gradle.api.internal.artifacts.ivyservice.resolveengine.graph.ResolvedConfigurationDependencyGraphVisitor] Attaching org.apache.maven:maven-repository-metadata:3.2.1(master) to its parents.
22-Mar-2017 19:46:06 19:46:06.638 [DEBUG] [org.gradle.api.internal.artifacts.ivyservice.resolveengine.graph.ResolvedConfigurationDependencyGraphVisitor] Attaching org.codehaus.plexus:plexus-component-annotations:1.5.5(compile) to its parents.
22-Mar-2017 19:46:06 19:46:06.638 [DEBUG] [org.gradle.api.internal.artifacts.ivyservice.resolveengine.graph.ResolvedConfigurationDependencyGraphVisitor] Attaching org.codehaus.plexus:plexus-component-annotations:1.5.5(master) to its parents.
22-Mar-2017 19:46:06 19:46:06.638 [DEBUG] [org.gradle.api.internal.artifacts.ivyservice.resolveengine.graph.ResolvedConfigurationDependencyGraphVisitor] Attaching org.codehaus.plexus:plexus-utils:3.0.17(compile) to its parents.
22-Mar-2017 19:46:06 19:46:06.638 [DEBUG] [org.gradle.api.internal.artifacts.ivyservice.resolveengine.graph.ResolvedConfigurationDependencyGraphVisitor] Attaching org.codehaus.plexus:plexus-utils:3.0.17(master) to its parents.
22-Mar-2017 19:46:06 19:46:06.638 [DEBUG] [org.gradle.api.internal.artifacts.ivyservice.resolveengine.graph.ResolvedConfigurationDependencyGraphVisitor] Attaching org.codehaus.plexus:plexus-interpolation:1.19(compile) to its parents.
22-Mar-2017 19:46:06 19:46:06.638 [DEBUG] [org.gradle.api.internal.artifacts.ivyservice.resolveengine.graph.ResolvedConfigurationDependencyGraphVisitor] Attaching org.codehaus.plexus:plexus-interpolation:1.19(master) to its parents.
22-Mar-2017 19:46:06 19:46:06.639 [DEBUG] [org.gradle.api.internal.artifacts.ivyservice.resolveengine.graph.ResolvedConfigurationDependencyGraphVisitor] Attaching org.apache.maven:maven-settings:3.1.1(compile) to its parents.
22-Mar-2017 19:46:06 19:46:06.639 [DEBUG] [org.gradle.api.internal.artifacts.ivyservice.resolveengine.graph.ResolvedConfigurationDependencyGraphVisitor] Attaching org.apache.maven:maven-settings:3.1.1(master) to its parents.
22-Mar-2017 19:46:06 19:46:06.639 [DEBUG] [org.gradle.api.internal.artifacts.ivyservice.resolveengine.graph.ResolvedConfigurationDependencyGraphVisitor] Attaching org.sonatype.plexus:plexus-sec-dispatcher:1.3(compile) to its parents.
22-Mar-2017 19:46:06 19:46:06.639 [DEBUG] [org.gradle.api.internal.artifacts.ivyservice.resolveengine.graph.ResolvedConfigurationDependencyGraphVisitor] Attaching org.sonatype.plexus:plexus-sec-dispatcher:1.3(master) to its parents.
22-Mar-2017 19:46:06 19:46:06.639 [DEBUG] [org.gradle.api.internal.artifacts.ivyservice.resolveengine.graph.ResolvedConfigurationDependencyGraphVisitor] Attaching org.apache.maven:maven-model:3.2.1(runtime) to its parents.
22-Mar-2017 19:46:06 19:46:06.639 [DEBUG] [org.gradle.api.internal.artifacts.ivyservice.resolveengine.graph.ResolvedConfigurationDependencyGraphVisitor] Attaching org.apache.maven:maven-model-builder:3.2.1(runtime) to its parents.
22-Mar-2017 19:46:06 19:46:06.639 [DEBUG] [org.gradle.api.internal.artifacts.ivyservice.resolveengine.graph.ResolvedConfigurationDependencyGraphVisitor] Attaching org.apache.maven:maven-repository-metadata:3.2.1(runtime) to its parents.
22-Mar-2017 19:46:06 19:46:06.639 [DEBUG] [org.gradle.api.internal.artifacts.ivyservice.resolveengine.graph.ResolvedConfigurationDependencyGraphVisitor] Attaching org.codehaus.plexus:plexus-component-annotations:1.5.5(runtime) to its parents.
22-Mar-2017 19:46:06 19:46:06.639 [DEBUG] [org.gradle.api.internal.artifacts.ivyservice.resolveengine.graph.ResolvedConfigurationDependencyGraphVisitor] Attaching org.codehaus.plexus:plexus-interpolation:1.19(runtime) to its parents.
22-Mar-2017 19:46:06 19:46:06.639 [DEBUG] [org.gradle.api.internal.artifacts.ivyservice.resolveengine.graph.ResolvedConfigurationDependencyGraphVisitor] Attaching org.apache.maven:maven-settings:3.1.1(runtime) to its parents.
22-Mar-2017 19:46:06 19:46:06.639 [DEBUG] [org.gradle.api.internal.artifacts.ivyservice.resolveengine.graph.ResolvedConfigurationDependencyGraphVisitor] Attaching org.sonatype.plexus:plexus-sec-dispatcher:1.3(runtime) to its parents.
22-Mar-2017 19:46:06 19:46:06.639 [DEBUG] [org.gradle.api.internal.artifacts.ivyservice.resolveengine.graph.ResolvedConfigurationDependencyGraphVisitor] Attaching commons-lang:commons-lang:2.6(compile) to its parents.
22-Mar-2017 19:46:06 19:46:06.639 [DEBUG] [org.gradle.api.internal.artifacts.ivyservice.resolveengine.graph.ResolvedConfigurationDependencyGraphVisitor] Attaching commons-lang:commons-lang:2.6(master) to its parents.
22-Mar-2017 19:46:06 19:46:06.639 [DEBUG] [org.gradle.api.internal.artifacts.ivyservice.resolveengine.graph.ResolvedConfigurationDependencyGraphVisitor] Attaching commons-cli:commons-cli:1.2(compile) to its parents.
22-Mar-2017 19:46:06 19:46:06.640 [DEBUG] [org.gradle.api.internal.artifacts.ivyservice.resolveengine.graph.ResolvedConfigurationDependencyGraphVisitor] Attaching commons-cli:commons-cli:1.2(master) to its parents.
22-Mar-2017 19:46:06 19:46:06.640 [DEBUG] [org.gradle.api.internal.artifacts.ivyservice.resolveengine.graph.ResolvedConfigurationDependencyGraphVisitor] Attaching org.apache.hadoop:hadoop-annotations:2.7.1(compile) to its parents.
22-Mar-2017 19:46:06 19:46:06.640 [DEBUG] [org.gradle.api.internal.artifacts.ivyservice.resolveengine.graph.ResolvedConfigurationDependencyGraphVisitor] Attaching org.apache.hadoop:hadoop-annotations:2.7.1(master) to its parents.
22-Mar-2017 19:46:06 19:46:06.640 [DEBUG] [org.gradle.api.internal.artifacts.ivyservice.resolveengine.graph.ResolvedConfigurationDependencyGraphVisitor] Attaching org.apache.hadoop:hadoop-yarn-api:2.7.1(compile) to its parents.
22-Mar-2017 19:46:06 19:46:06.640 [DEBUG] [org.gradle.api.internal.artifacts.ivyservice.resolveengine.graph.ResolvedConfigurationDependencyGraphVisitor] Attaching org.apache.hadoop:hadoop-yarn-api:2.7.1(master) to its parents.
22-Mar-2017 19:46:06 19:46:06.640 [DEBUG] [org.gradle.api.internal.artifacts.ivyservice.resolveengine.graph.ResolvedConfigurationDependencyGraphVisitor] Attaching org.apache.hadoop:hadoop-yarn-common:2.7.1(compile) to its parents.
22-Mar-2017 19:46:06 19:46:06.640 [DEBUG] [org.gradle.api.internal.artifacts.ivyservice.resolveengine.graph.ResolvedConfigurationDependencyGraphVisitor] Attaching org.apache.hadoop:hadoop-yarn-common:2.7.1(master) to its parents.
22-Mar-2017 19:46:06 19:46:06.640 [DEBUG] [org.gradle.api.internal.artifacts.ivyservice.resolveengine.graph.ResolvedConfigurationDependencyGraphVisitor] Attaching org.apache.commons:commons-math3:3.1.1(compile) to its parents.
22-Mar-2017 19:46:06 19:46:06.640 [DEBUG] [org.gradle.api.internal.artifacts.ivyservice.resolveengine.graph.ResolvedConfigurationDependencyGraphVisitor] Attaching org.apache.commons:commons-math3:3.1.1(master) to its parents.
22-Mar-2017 19:46:06 19:46:06.640 [DEBUG] [org.gradle.api.internal.artifacts.ivyservice.resolveengine.graph.ResolvedConfigurationDependencyGraphVisitor] Attaching xmlenc:xmlenc:0.52(compile) to its parents.
22-Mar-2017 19:46:06 19:46:06.640 [DEBUG] [org.gradle.api.internal.artifacts.ivyservice.resolveengine.graph.ResolvedConfigurationDependencyGraphVisitor] Attaching xmlenc:xmlenc:0.52(master) to its parents.
22-Mar-2017 19:46:06 19:46:06.640 [DEBUG] [org.gradle.api.internal.artifacts.ivyservice.resolveengine.graph.ResolvedConfigurationDependencyGraphVisitor] Attaching commons-httpclient:commons-httpclient:3.1(compile) to its parents.
22-Mar-2017 19:46:06 19:46:06.641 [DEBUG] [org.gradle.api.internal.artifacts.ivyservice.resolveengine.graph.ResolvedConfigurationDependencyGraphVisitor] Attaching commons-httpclient:commons-httpclient:3.1(master) to its parents.
22-Mar-2017 19:46:06 19:46:06.641 [DEBUG] [org.gradle.api.internal.artifacts.ivyservice.resolveengine.graph.ResolvedConfigurationDependencyGraphVisitor] Attaching commons-io:commons-io:2.4(compile) to its parents.
22-Mar-2017 19:46:06 19:46:06.641 [DEBUG] [org.gradle.api.internal.artifacts.ivyservice.resolveengine.graph.ResolvedConfigurationDependencyGraphVisitor] Attaching commons-io:commons-io:2.4(master) to its parents.
22-Mar-2017 19:46:06 19:46:06.641 [DEBUG] [org.gradle.api.internal.artifacts.ivyservice.resolveengine.graph.ResolvedConfigurationDependencyGraphVisitor] Attaching commons-net:commons-net:3.3(compile) to its parents.
22-Mar-2017 19:46:06 19:46:06.641 [DEBUG] [org.gradle.api.internal.artifacts.ivyservice.resolveengine.graph.ResolvedConfigurationDependencyGraphVisitor] Attaching commons-net:commons-net:3.3(master) to its parents.
22-Mar-2017 19:46:06 19:46:06.641 [DEBUG] [org.gradle.api.internal.artifacts.ivyservice.resolveengine.graph.ResolvedConfigurationDependencyGraphVisitor] Attaching commons-collections:commons-collections:3.2.1(compile) to its parents.
22-Mar-2017 19:46:06 19:46:06.641 [DEBUG] [org.gradle.api.internal.artifacts.ivyservice.resolveengine.graph.ResolvedConfigurationDependencyGraphVisitor] Attaching commons-collections:commons-collections:3.2.1(master) to its parents.
22-Mar-2017 19:46:06 19:46:06.641 [DEBUG] [org.gradle.api.internal.artifacts.ivyservice.resolveengine.graph.ResolvedConfigurationDependencyGraphVisitor] Attaching javax.servlet:servlet-api:2.5(compile) to its parents.
22-Mar-2017 19:46:06 19:46:06.641 [DEBUG] [org.gradle.api.internal.artifacts.ivyservice.resolveengine.graph.ResolvedConfigurationDependencyGraphVisitor] Attaching javax.servlet:servlet-api:2.5(master) to its parents.
22-Mar-2017 19:46:06 19:46:06.641 [DEBUG] [org.gradle.api.internal.artifacts.ivyservice.resolveengine.graph.ResolvedConfigurationDependencyGraphVisitor] Attaching com.sun.jersey:jersey-json:1.9(compile) to its parents.
22-Mar-2017 19:46:06 19:46:06.641 [DEBUG] [org.gradle.api.internal.artifacts.ivyservice.resolveengine.graph.ResolvedConfigurationDependencyGraphVisitor] Attaching com.sun.jersey:jersey-json:1.9(master) to its parents.
22-Mar-2017 19:46:06 19:46:06.641 [DEBUG] [org.gradle.api.internal.artifacts.ivyservice.resolveengine.graph.ResolvedConfigurationDependencyGraphVisitor] Attaching commons-configuration:commons-configuration:1.6(compile) to its parents.
22-Mar-2017 19:46:06 19:46:06.641 [DEBUG] [org.gradle.api.internal.artifacts.ivyservice.resolveengine.graph.ResolvedConfigurationDependencyGraphVisitor] Attaching commons-configuration:commons-configuration:1.6(master) to its parents.
22-Mar-2017 19:46:06 19:46:06.641 [DEBUG] [org.gradle.api.internal.artifacts.ivyservice.resolveengine.graph.ResolvedConfigurationDependencyGraphVisitor] Attaching org.apache.avro:avro:1.7.4(compile) to its parents.
22-Mar-2017 19:46:06 19:46:06.642 [DEBUG] [org.gradle.api.internal.artifacts.ivyservice.resolveengine.graph.ResolvedConfigurationDependencyGraphVisitor] Attaching org.apache.avro:avro:1.7.4(master) to its parents.
22-Mar-2017 19:46:06 19:46:06.642 [DEBUG] [org.gradle.api.internal.artifacts.ivyservice.resolveengine.graph.ResolvedConfigurationDependencyGraphVisitor] Attaching com.google.protobuf:protobuf-java:2.5.0(compile) to its parents.
22-Mar-2017 19:46:06 19:46:06.642 [DEBUG] [org.gradle.api.internal.artifacts.ivyservice.resolveengine.graph.ResolvedConfigurationDependencyGraphVisitor] Attaching com.google.protobuf:protobuf-java:2.5.0(master) to its parents.
22-Mar-2017 19:46:06 19:46:06.642 [DEBUG] [org.gradle.api.internal.artifacts.ivyservice.resolveengine.graph.ResolvedConfigurationDependencyGraphVisitor] Attaching com.google.code.gson:gson:2.2.4(compile) to its parents.
22-Mar-2017 19:46:06 19:46:06.642 [DEBUG] [org.gradle.api.internal.artifacts.ivyservice.resolveengine.graph.ResolvedConfigurationDependencyGraphVisitor] Attaching com.google.code.gson:gson:2.2.4(master) to its parents.
22-Mar-2017 19:46:06 19:46:06.642 [DEBUG] [org.gradle.api.internal.artifacts.ivyservice.resolveengine.graph.ResolvedConfigurationDependencyGraphVisitor] Attaching org.apache.hadoop:hadoop-auth:2.7.1(compile) to its parents.
22-Mar-2017 19:46:06 19:46:06.642 [DEBUG] [org.gradle.api.internal.artifacts.ivyservice.resolveengine.graph.ResolvedConfigurationDependencyGraphVisitor] Attaching org.apache.hadoop:hadoop-auth:2.7.1(master) to its parents.
22-Mar-2017 19:46:06 19:46:06.642 [DEBUG] [org.gradle.api.internal.artifacts.ivyservice.resolveengine.graph.ResolvedConfigurationDependencyGraphVisitor] Attaching org.apache.curator:curator-client:2.6.0(compile) to its parents.
22-Mar-2017 19:46:06 19:46:06.642 [DEBUG] [org.gradle.api.internal.artifacts.ivyservice.resolveengine.graph.ResolvedConfigurationDependencyGraphVisitor] Attaching org.apache.curator:curator-client:2.6.0(master) to its parents.
22-Mar-2017 19:46:06 19:46:06.642 [DEBUG] [org.gradle.api.internal.artifacts.ivyservice.resolveengine.graph.ResolvedConfigurationDependencyGraphVisitor] Attaching org.apache.curator:curator-recipes:2.6.0(compile) to its parents.
22-Mar-2017 19:46:06 19:46:06.642 [DEBUG] [org.gradle.api.internal.artifacts.ivyservice.resolveengine.graph.ResolvedConfigurationDependencyGraphVisitor] Attaching org.apache.curator:curator-recipes:2.6.0(master) to its parents.
22-Mar-2017 19:46:06 19:46:06.642 [DEBUG] [org.gradle.api.internal.artifacts.ivyservice.resolveengine.graph.ResolvedConfigurationDependencyGraphVisitor] Attaching com.google.code.findbugs:jsr305:2.0.0(compile) to its parents.
22-Mar-2017 19:46:06 19:46:06.642 [DEBUG] [org.gradle.api.internal.artifacts.ivyservice.resolveengine.graph.ResolvedConfigurationDependencyGraphVisitor] Attaching com.google.code.findbugs:jsr305:2.0.0(master) to its parents.
22-Mar-2017 19:46:06 19:46:06.643 [DEBUG] [org.gradle.api.internal.artifacts.ivyservice.resolveengine.graph.ResolvedConfigurationDependencyGraphVisitor] Attaching org.apache.htrace:htrace-core:3.1.0-incubating(compile) to its parents.
22-Mar-2017 19:46:06 19:46:06.643 [DEBUG] [org.gradle.api.internal.artifacts.ivyservice.resolveengine.graph.ResolvedConfigurationDependencyGraphVisitor] Attaching org.apache.htrace:htrace-core:3.1.0-incubating(master) to its parents.
22-Mar-2017 19:46:06 19:46:06.643 [DEBUG] [org.gradle.api.internal.artifacts.ivyservice.resolveengine.graph.ResolvedConfigurationDependencyGraphVisitor] Attaching org.apache.zookeeper:zookeeper:3.4.6(compile) to its parents.
22-Mar-2017 19:46:06 19:46:06.643 [DEBUG] [org.gradle.api.internal.artifacts.ivyservice.resolveengine.graph.ResolvedConfigurationDependencyGraphVisitor] Attaching org.apache.zookeeper:zookeeper:3.4.6(master) to its parents.
22-Mar-2017 19:46:06 19:46:06.643 [DEBUG] [org.gradle.api.internal.artifacts.ivyservice.resolveengine.graph.ResolvedConfigurationDependencyGraphVisitor] Attaching org.apache.commons:commons-compress:1.4.1(compile) to its parents.
22-Mar-2017 19:46:06 19:46:06.643 [DEBUG] [org.gradle.api.internal.artifacts.ivyservice.resolveengine.graph.ResolvedConfigurationDependencyGraphVisitor] Attaching org.apache.commons:commons-compress:1.4.1(master) to its parents.
22-Mar-2017 19:46:06 19:46:06.643 [DEBUG] [org.gradle.api.internal.artifacts.ivyservice.resolveengine.graph.ResolvedConfigurationDependencyGraphVisitor] Attaching org.springframework.data:spring-data-hadoop-hive:2.2.1.RELEASE(compile) to its parents.
22-Mar-2017 19:46:06 19:46:06.643 [DEBUG] [org.gradle.api.internal.artifacts.ivyservice.resolveengine.graph.ResolvedConfigurationDependencyGraphVisitor] Attaching org.springframework.data:spring-data-hadoop-hive:2.2.1.RELEASE(master) to its parents.
22-Mar-2017 19:46:06 19:46:06.643 [DEBUG] [org.gradle.api.internal.artifacts.ivyservice.resolveengine.graph.ResolvedConfigurationDependencyGraphVisitor] Attaching org.springframework.data:spring-data-hadoop-batch:2.2.1.RELEASE(compile) to its parents.
22-Mar-2017 19:46:06 19:46:06.643 [DEBUG] [org.gradle.api.internal.artifacts.ivyservice.resolveengine.graph.ResolvedConfigurationDependencyGraphVisitor] Attaching org.springframework.data:spring-data-hadoop-batch:2.2.1.RELEASE(master) to its parents.
22-Mar-2017 19:46:06 19:46:06.644 [DEBUG] [org.gradle.api.internal.artifacts.ivyservice.resolveengine.graph.ResolvedConfigurationDependencyGraphVisitor] Attaching org.springframework.data:spring-data-hadoop-hbase:2.2.1.RELEASE(compile) to its parents.
22-Mar-2017 19:46:06 19:46:06.644 [DEBUG] [org.gradle.api.internal.artifacts.ivyservice.resolveengine.graph.ResolvedConfigurationDependencyGraphVisitor] Attaching org.springframework.data:spring-data-hadoop-hbase:2.2.1.RELEASE(master) to its parents.
22-Mar-2017 19:46:06 19:46:06.644 [DEBUG] [org.gradle.api.internal.artifacts.ivyservice.resolveengine.graph.ResolvedConfigurationDependencyGraphVisitor] Attaching org.springframework.data:spring-data-hadoop-core:2.2.1.RELEASE(compile) to its parents.
22-Mar-2017 19:46:06 19:46:06.644 [DEBUG] [org.gradle.api.internal.artifacts.ivyservice.resolveengine.graph.ResolvedConfigurationDependencyGraphVisitor] Attaching org.springframework.data:spring-data-hadoop-core:2.2.1.RELEASE(master) to its parents.
22-Mar-2017 19:46:06 19:46:06.644 [DEBUG] [org.gradle.api.internal.artifacts.ivyservice.resolveengine.graph.ResolvedConfigurationDependencyGraphVisitor] Attaching org.springframework.data:spring-data-hadoop-pig:2.2.1.RELEASE(compile) to its parents.
22-Mar-2017 19:46:06 19:46:06.644 [DEBUG] [org.gradle.api.internal.artifacts.ivyservice.resolveengine.graph.ResolvedConfigurationDependencyGraphVisitor] Attaching org.springframework.data:spring-data-hadoop-pig:2.2.1.RELEASE(master) to its parents.
22-Mar-2017 19:46:06 19:46:06.644 [DEBUG] [org.gradle.api.internal.artifacts.ivyservice.resolveengine.graph.ResolvedConfigurationDependencyGraphVisitor] Attaching com.fasterxml.jackson.core:jackson-annotations:2.4.5(compile) to its parents.
22-Mar-2017 19:46:06 19:46:06.644 [DEBUG] [org.gradle.api.internal.artifacts.ivyservice.resolveengine.graph.ResolvedConfigurationDependencyGraphVisitor] Attaching com.fasterxml.jackson.core:jackson-annotations:2.4.5(master) to its parents.
22-Mar-2017 19:46:06 19:46:06.644 [DEBUG] [org.gradle.api.internal.artifacts.ivyservice.resolveengine.graph.ResolvedConfigurationDependencyGraphVisitor] Attaching com.fasterxml.jackson.core:jackson-core:2.4.5(compile) to its parents.
22-Mar-2017 19:46:06 19:46:06.644 [DEBUG] [org.gradle.api.internal.artifacts.ivyservice.resolveengine.graph.ResolvedConfigurationDependencyGraphVisitor] Attaching com.fasterxml.jackson.core:jackson-core:2.4.5(master) to its parents.
22-Mar-2017 19:46:06 19:46:06.644 [DEBUG] [org.gradle.api.internal.artifacts.ivyservice.resolveengine.graph.ResolvedConfigurationDependencyGraphVisitor] Attaching commons-lang:commons-lang:2.6(runtime) to its parents.
22-Mar-2017 19:46:06 19:46:06.644 [DEBUG] [org.gradle.api.internal.artifacts.ivyservice.resolveengine.graph.ResolvedConfigurationDependencyGraphVisitor] Attaching commons-cli:commons-cli:1.2(runtime) to its parents.
22-Mar-2017 19:46:06 19:46:06.645 [DEBUG] [org.gradle.api.internal.artifacts.ivyservice.resolveengine.graph.ResolvedConfigurationDependencyGraphVisitor] Attaching org.apache.hadoop:hadoop-annotations:2.7.1(runtime) to its parents.
22-Mar-2017 19:46:06 19:46:06.645 [DEBUG] [org.gradle.api.internal.artifacts.ivyservice.resolveengine.graph.ResolvedConfigurationDependencyGraphVisitor] Attaching org.apache.hadoop:hadoop-yarn-api:2.7.1(runtime) to its parents.
22-Mar-2017 19:46:06 19:46:06.645 [DEBUG] [org.gradle.api.internal.artifacts.ivyservice.resolveengine.graph.ResolvedConfigurationDependencyGraphVisitor] Attaching org.apache.hadoop:hadoop-yarn-common:2.7.1(runtime) to its parents.
22-Mar-2017 19:46:06 19:46:06.645 [DEBUG] [org.gradle.api.internal.artifacts.ivyservice.resolveengine.graph.ResolvedConfigurationDependencyGraphVisitor] Attaching org.apache.commons:commons-math3:3.1.1(runtime) to its parents.
22-Mar-2017 19:46:06 19:46:06.645 [DEBUG] [org.gradle.api.internal.artifacts.ivyservice.resolveengine.graph.ResolvedConfigurationDependencyGraphVisitor] Attaching xmlenc:xmlenc:0.52(runtime) to its parents.
22-Mar-2017 19:46:06 19:46:06.645 [DEBUG] [org.gradle.api.internal.artifacts.ivyservice.resolveengine.graph.ResolvedConfigurationDependencyGraphVisitor] Attaching commons-httpclient:commons-httpclient:3.1(runtime) to its parents.
22-Mar-2017 19:46:06 19:46:06.645 [DEBUG] [org.gradle.api.internal.artifacts.ivyservice.resolveengine.graph.ResolvedConfigurationDependencyGraphVisitor] Attaching commons-io:commons-io:2.4(runtime) to its parents.
22-Mar-2017 19:46:06 19:46:06.645 [DEBUG] [org.gradle.api.internal.artifacts.ivyservice.resolveengine.graph.ResolvedConfigurationDependencyGraphVisitor] Attaching commons-net:commons-net:3.3(runtime) to its parents.
22-Mar-2017 19:46:06 19:46:06.645 [DEBUG] [org.gradle.api.internal.artifacts.ivyservice.resolveengine.graph.ResolvedConfigurationDependencyGraphVisitor] Attaching commons-collections:commons-collections:3.2.1(runtime) to its parents.
22-Mar-2017 19:46:06 19:46:06.645 [DEBUG] [org.gradle.api.internal.artifacts.ivyservice.resolveengine.graph.ResolvedConfigurationDependencyGraphVisitor] Attaching javax.servlet:servlet-api:2.5(runtime) to its parents.
22-Mar-2017 19:46:06 19:46:06.645 [DEBUG] [org.gradle.api.internal.artifacts.ivyservice.resolveengine.graph.ResolvedConfigurationDependencyGraphVisitor] Attaching com.sun.jersey:jersey-json:1.9(runtime) to its parents.
22-Mar-2017 19:46:06 19:46:06.645 [DEBUG] [org.gradle.api.internal.artifacts.ivyservice.resolveengine.graph.ResolvedConfigurationDependencyGraphVisitor] Attaching commons-configuration:commons-configuration:1.6(runtime) to its parents.
22-Mar-2017 19:46:06 19:46:06.645 [DEBUG] [org.gradle.api.internal.artifacts.ivyservice.resolveengine.graph.ResolvedConfigurationDependencyGraphVisitor] Attaching org.apache.avro:avro:1.7.4(runtime) to its parents.
22-Mar-2017 19:46:06 19:46:06.646 [DEBUG] [org.gradle.api.internal.artifacts.ivyservice.resolveengine.graph.ResolvedConfigurationDependencyGraphVisitor] Attaching com.google.protobuf:protobuf-java:2.5.0(runtime) to its parents.
22-Mar-2017 19:46:06 19:46:06.646 [DEBUG] [org.gradle.api.internal.artifacts.ivyservice.resolveengine.graph.ResolvedConfigurationDependencyGraphVisitor] Attaching com.google.code.gson:gson:2.2.4(runtime) to its parents.
22-Mar-2017 19:46:06 19:46:06.646 [DEBUG] [org.gradle.api.internal.artifacts.ivyservice.resolveengine.graph.ResolvedConfigurationDependencyGraphVisitor] Attaching org.apache.hadoop:hadoop-auth:2.7.1(runtime) to its parents.
22-Mar-2017 19:46:06 19:46:06.646 [DEBUG] [org.gradle.api.internal.artifacts.ivyservice.resolveengine.graph.ResolvedConfigurationDependencyGraphVisitor] Attaching org.apache.curator:curator-client:2.6.0(runtime) to its parents.
22-Mar-2017 19:46:06 19:46:06.646 [DEBUG] [org.gradle.api.internal.artifacts.ivyservice.resolveengine.graph.ResolvedConfigurationDependencyGraphVisitor] Attaching org.apache.curator:curator-recipes:2.6.0(runtime) to its parents.
22-Mar-2017 19:46:06 19:46:06.646 [DEBUG] [org.gradle.api.internal.artifacts.ivyservice.resolveengine.graph.ResolvedConfigurationDependencyGraphVisitor] Attaching com.google.code.findbugs:jsr305:2.0.0(runtime) to its parents.
22-Mar-2017 19:46:06 19:46:06.646 [DEBUG] [org.gradle.api.internal.artifacts.ivyservice.resolveengine.graph.ResolvedConfigurationDependencyGraphVisitor] Attaching org.apache.htrace:htrace-core:3.1.0-incubating(runtime) to its parents.
22-Mar-2017 19:46:06 19:46:06.646 [DEBUG] [org.gradle.api.internal.artifacts.ivyservice.resolveengine.graph.ResolvedConfigurationDependencyGraphVisitor] Attaching org.apache.zookeeper:zookeeper:3.4.6(runtime) to its parents.
22-Mar-2017 19:46:06 19:46:06.646 [DEBUG] [org.gradle.api.internal.artifacts.ivyservice.resolveengine.graph.ResolvedConfigurationDependencyGraphVisitor] Attaching org.apache.commons:commons-compress:1.4.1(runtime) to its parents.
22-Mar-2017 19:46:06 19:46:06.646 [DEBUG] [org.gradle.api.internal.artifacts.ivyservice.resolveengine.graph.ResolvedConfigurationDependencyGraphVisitor] Attaching org.springframework.data:spring-data-hadoop-hive:2.2.1.RELEASE(runtime) to its parents.
22-Mar-2017 19:46:06 19:46:06.646 [DEBUG] [org.gradle.api.internal.artifacts.ivyservice.resolveengine.graph.ResolvedConfigurationDependencyGraphVisitor] Attaching org.springframework.data:spring-data-hadoop-batch:2.2.1.RELEASE(runtime) to its parents.
22-Mar-2017 19:46:06 19:46:06.647 [DEBUG] [org.gradle.api.internal.artifacts.ivyservice.resolveengine.graph.ResolvedConfigurationDependencyGraphVisitor] Attaching org.springframework.data:spring-data-hadoop-hbase:2.2.1.RELEASE(runtime) to its parents.
22-Mar-2017 19:46:06 19:46:06.647 [DEBUG] [org.gradle.api.internal.artifacts.ivyservice.resolveengine.graph.ResolvedConfigurationDependencyGraphVisitor] Attaching org.springframework.data:spring-data-hadoop-core:2.2.1.RELEASE(runtime) to its parents.
22-Mar-2017 19:46:06 19:46:06.647 [DEBUG] [org.gradle.api.internal.artifacts.ivyservice.resolveengine.graph.ResolvedConfigurationDependencyGraphVisitor] Attaching org.springframework.data:spring-data-hadoop-pig:2.2.1.RELEASE(runtime) to its parents.
22-Mar-2017 19:46:06 19:46:06.647 [DEBUG] [org.gradle.api.internal.artifacts.ivyservice.resolveengine.graph.ResolvedConfigurationDependencyGraphVisitor] Attaching com.fasterxml.jackson.core:jackson-annotations:2.4.5(runtime) to its parents.
22-Mar-2017 19:46:06 19:46:06.647 [DEBUG] [org.gradle.api.internal.artifacts.ivyservice.resolveengine.graph.ResolvedConfigurationDependencyGraphVisitor] Attaching com.fasterxml.jackson.core:jackson-core:2.4.5(runtime) to its parents.
22-Mar-2017 19:46:06 19:46:06.647 [DEBUG] [org.gradle.api.internal.artifacts.ivyservice.resolveengine.graph.ResolvedConfigurationDependencyGraphVisitor] Attaching org.sonatype.plexus:plexus-cipher:1.4(compile) to its parents.
22-Mar-2017 19:46:06 19:46:06.647 [DEBUG] [org.gradle.api.internal.artifacts.ivyservice.resolveengine.graph.ResolvedConfigurationDependencyGraphVisitor] Attaching org.sonatype.plexus:plexus-cipher:1.4(master) to its parents.
22-Mar-2017 19:46:06 19:46:06.647 [DEBUG] [org.gradle.api.internal.artifacts.ivyservice.resolveengine.graph.ResolvedConfigurationDependencyGraphVisitor] Attaching org.sonatype.plexus:plexus-cipher:1.4(runtime) to its parents.
22-Mar-2017 19:46:06 19:46:06.647 [DEBUG] [org.gradle.api.internal.artifacts.ivyservice.resolveengine.graph.ResolvedConfigurationDependencyGraphVisitor] Attaching javax.xml.bind:jaxb-api:2.2.2(compile) to its parents.
22-Mar-2017 19:46:06 19:46:06.647 [DEBUG] [org.gradle.api.internal.artifacts.ivyservice.resolveengine.graph.ResolvedConfigurationDependencyGraphVisitor] Attaching javax.xml.bind:jaxb-api:2.2.2(master) to its parents.
22-Mar-2017 19:46:06 19:46:06.647 [DEBUG] [org.gradle.api.internal.artifacts.ivyservice.resolveengine.graph.ResolvedConfigurationDependencyGraphVisitor] Attaching com.sun.jersey:jersey-client:1.9(compile) to its parents.
22-Mar-2017 19:46:06 19:46:06.647 [DEBUG] [org.gradle.api.internal.artifacts.ivyservice.resolveengine.graph.ResolvedConfigurationDependencyGraphVisitor] Attaching com.sun.jersey:jersey-client:1.9(master) to its parents.
22-Mar-2017 19:46:06 19:46:06.647 [DEBUG] [org.gradle.api.internal.artifacts.ivyservice.resolveengine.graph.ResolvedConfigurationDependencyGraphVisitor] Attaching org.codehaus.jackson:jackson-jaxrs:1.9.13(compile) to its parents.
22-Mar-2017 19:46:06 19:46:06.647 [DEBUG] [org.gradle.api.internal.artifacts.ivyservice.resolveengine.graph.ResolvedConfigurationDependencyGraphVisitor] Attaching org.codehaus.jackson:jackson-jaxrs:1.9.13(master) to its parents.
22-Mar-2017 19:46:06 19:46:06.648 [DEBUG] [org.gradle.api.internal.artifacts.ivyservice.resolveengine.graph.ResolvedConfigurationDependencyGraphVisitor] Attaching org.codehaus.jackson:jackson-xc:1.9.13(compile) to its parents.
22-Mar-2017 19:46:06 19:46:06.648 [DEBUG] [org.gradle.api.internal.artifacts.ivyservice.resolveengine.graph.ResolvedConfigurationDependencyGraphVisitor] Attaching org.codehaus.jackson:jackson-xc:1.9.13(master) to its parents.
22-Mar-2017 19:46:06 19:46:06.648 [DEBUG] [org.gradle.api.internal.artifacts.ivyservice.resolveengine.graph.ResolvedConfigurationDependencyGraphVisitor] Attaching com.google.inject.extensions:guice-servlet:3.0(compile) to its parents.
22-Mar-2017 19:46:06 19:46:06.648 [DEBUG] [org.gradle.api.internal.artifacts.ivyservice.resolveengine.graph.ResolvedConfigurationDependencyGraphVisitor] Attaching com.google.inject.extensions:guice-servlet:3.0(master) to its parents.
22-Mar-2017 19:46:06 19:46:06.648 [DEBUG] [org.gradle.api.internal.artifacts.ivyservice.resolveengine.graph.ResolvedConfigurationDependencyGraphVisitor] Attaching com.google.inject:guice:3.0(compile) to its parents.
22-Mar-2017 19:46:06 19:46:06.648 [DEBUG] [org.gradle.api.internal.artifacts.ivyservice.resolveengine.graph.ResolvedConfigurationDependencyGraphVisitor] Attaching com.google.inject:guice:3.0(master) to its parents.
22-Mar-2017 19:46:06 19:46:06.648 [DEBUG] [org.gradle.api.internal.artifacts.ivyservice.resolveengine.graph.ResolvedConfigurationDependencyGraphVisitor] Attaching com.sun.jersey.contribs:jersey-guice:1.9(compile) to its parents.
22-Mar-2017 19:46:06 19:46:06.648 [DEBUG] [org.gradle.api.internal.artifacts.ivyservice.resolveengine.graph.ResolvedConfigurationDependencyGraphVisitor] Attaching com.sun.jersey.contribs:jersey-guice:1.9(master) to its parents.
22-Mar-2017 19:46:06 19:46:06.648 [DEBUG] [org.gradle.api.internal.artifacts.ivyservice.resolveengine.graph.ResolvedConfigurationDependencyGraphVisitor] Attaching com.sun.xml.bind:jaxb-impl:2.2.3-1(compile) to its parents.
22-Mar-2017 19:46:06 19:46:06.648 [DEBUG] [org.gradle.api.internal.artifacts.ivyservice.resolveengine.graph.ResolvedConfigurationDependencyGraphVisitor] Attaching com.sun.xml.bind:jaxb-impl:2.2.3-1(master) to its parents.
22-Mar-2017 19:46:06 19:46:06.648 [DEBUG] [org.gradle.api.internal.artifacts.ivyservice.resolveengine.graph.ResolvedConfigurationDependencyGraphVisitor] Attaching commons-digester:commons-digester:2.1(compile) to its parents.
22-Mar-2017 19:46:06 19:46:06.648 [DEBUG] [org.gradle.api.internal.artifacts.ivyservice.resolveengine.graph.ResolvedConfigurationDependencyGraphVisitor] Attaching commons-digester:commons-digester:2.1(master) to its parents.
22-Mar-2017 19:46:06 19:46:06.648 [DEBUG] [org.gradle.api.internal.artifacts.ivyservice.resolveengine.graph.ResolvedConfigurationDependencyGraphVisitor] Attaching commons-beanutils:commons-beanutils-core:1.8.3(compile) to its parents.
22-Mar-2017 19:46:06 19:46:06.649 [DEBUG] [org.gradle.api.internal.artifacts.ivyservice.resolveengine.graph.ResolvedConfigurationDependencyGraphVisitor] Attaching commons-beanutils:commons-beanutils-core:1.8.3(master) to its parents.
22-Mar-2017 19:46:06 19:46:06.649 [DEBUG] [org.gradle.api.internal.artifacts.ivyservice.resolveengine.graph.ResolvedConfigurationDependencyGraphVisitor] Attaching com.thoughtworks.paranamer:paranamer:2.3(compile) to its parents.
22-Mar-2017 19:46:06 19:46:06.649 [DEBUG] [org.gradle.api.internal.artifacts.ivyservice.resolveengine.graph.ResolvedConfigurationDependencyGraphVisitor] Attaching com.thoughtworks.paranamer:paranamer:2.3(master) to its parents.
22-Mar-2017 19:46:06 19:46:06.649 [DEBUG] [org.gradle.api.internal.artifacts.ivyservice.resolveengine.graph.ResolvedConfigurationDependencyGraphVisitor] Attaching org.xerial.snappy:snappy-java:1.1.0.1(compile) to its parents.
22-Mar-2017 19:46:06 19:46:06.649 [DEBUG] [org.gradle.api.internal.artifacts.ivyservice.resolveengine.graph.ResolvedConfigurationDependencyGraphVisitor] Attaching org.xerial.snappy:snappy-java:1.1.0.1(master) to its parents.
22-Mar-2017 19:46:06 19:46:06.649 [DEBUG] [org.gradle.api.internal.artifacts.ivyservice.resolveengine.graph.ResolvedConfigurationDependencyGraphVisitor] Attaching org.apache.directory.server:apacheds-kerberos-codec:2.0.0-M15(compile) to its parents.
22-Mar-2017 19:46:06 19:46:06.649 [DEBUG] [org.gradle.api.internal.artifacts.ivyservice.resolveengine.graph.ResolvedConfigurationDependencyGraphVisitor] Attaching org.apache.directory.server:apacheds-kerberos-codec:2.0.0-M15(master) to its parents.
22-Mar-2017 19:46:06 19:46:06.649 [DEBUG] [org.gradle.api.internal.artifacts.ivyservice.resolveengine.graph.ResolvedConfigurationDependencyGraphVisitor] Attaching org.apache.curator:curator-framework:2.6.0(compile) to its parents.
22-Mar-2017 19:46:06 19:46:06.649 [DEBUG] [org.gradle.api.internal.artifacts.ivyservice.resolveengine.graph.ResolvedConfigurationDependencyGraphVisitor] Attaching org.apache.curator:curator-framework:2.6.0(master) to its parents.
22-Mar-2017 19:46:06 19:46:06.649 [DEBUG] [org.gradle.api.internal.artifacts.ivyservice.resolveengine.graph.ResolvedConfigurationDependencyGraphVisitor] Attaching org.tukaani:xz:1.0(compile) to its parents.
22-Mar-2017 19:46:06 19:46:06.649 [DEBUG] [org.gradle.api.internal.artifacts.ivyservice.resolveengine.graph.ResolvedConfigurationDependencyGraphVisitor] Attaching org.tukaani:xz:1.0(master) to its parents.
22-Mar-2017 19:46:06 19:46:06.649 [DEBUG] [org.gradle.api.internal.artifacts.ivyservice.resolveengine.graph.ResolvedConfigurationDependencyGraphVisitor] Attaching org.apache.hadoop:hadoop-hdfs:2.7.1(compile) to its parents.
22-Mar-2017 19:46:06 19:46:06.649 [DEBUG] [org.gradle.api.internal.artifacts.ivyservice.resolveengine.graph.ResolvedConfigurationDependencyGraphVisitor] Attaching org.apache.hadoop:hadoop-hdfs:2.7.1(master) to its parents.
22-Mar-2017 19:46:06 19:46:06.649 [DEBUG] [org.gradle.api.internal.artifacts.ivyservice.resolveengine.graph.ResolvedConfigurationDependencyGraphVisitor] Attaching org.apache.hadoop:hadoop-mapreduce-client-core:2.7.1(compile) to its parents.
22-Mar-2017 19:46:06 19:46:06.650 [DEBUG] [org.gradle.api.internal.artifacts.ivyservice.resolveengine.graph.ResolvedConfigurationDependencyGraphVisitor] Attaching org.apache.hadoop:hadoop-mapreduce-client-core:2.7.1(master) to its parents.
22-Mar-2017 19:46:06 19:46:06.650 [DEBUG] [org.gradle.api.internal.artifacts.ivyservice.resolveengine.graph.ResolvedConfigurationDependencyGraphVisitor] Attaching org.springframework.batch:spring-batch-core:3.0.5.RELEASE(compile) to its parents.
22-Mar-2017 19:46:06 19:46:06.650 [DEBUG] [org.gradle.api.internal.artifacts.ivyservice.resolveengine.graph.ResolvedConfigurationDependencyGraphVisitor] Attaching org.springframework.batch:spring-batch-core:3.0.5.RELEASE(master) to its parents.
22-Mar-2017 19:46:06 19:46:06.650 [DEBUG] [org.gradle.api.internal.artifacts.ivyservice.resolveengine.graph.ResolvedConfigurationDependencyGraphVisitor] Attaching org.apache.hadoop:hadoop-streaming:2.7.1(compile) to its parents.
22-Mar-2017 19:46:06 19:46:06.650 [DEBUG] [org.gradle.api.internal.artifacts.ivyservice.resolveengine.graph.ResolvedConfigurationDependencyGraphVisitor] Attaching org.apache.hadoop:hadoop-streaming:2.7.1(master) to its parents.
22-Mar-2017 19:46:06 19:46:06.650 [DEBUG] [org.gradle.api.internal.artifacts.ivyservice.resolveengine.graph.ResolvedConfigurationDependencyGraphVisitor] Attaching org.apache.hadoop:hadoop-distcp:2.7.1(compile) to its parents.
22-Mar-2017 19:46:06 19:46:06.650 [DEBUG] [org.gradle.api.internal.artifacts.ivyservice.resolveengine.graph.ResolvedConfigurationDependencyGraphVisitor] Attaching org.apache.hadoop:hadoop-distcp:2.7.1(master) to its parents.
22-Mar-2017 19:46:06 19:46:06.650 [DEBUG] [org.gradle.api.internal.artifacts.ivyservice.resolveengine.graph.ResolvedConfigurationDependencyGraphVisitor] Attaching org.apache.hadoop:hadoop-mapreduce-client-jobclient:2.7.1(compile) to its parents.
22-Mar-2017 19:46:06 19:46:06.650 [DEBUG] [org.gradle.api.internal.artifacts.ivyservice.resolveengine.graph.ResolvedConfigurationDependencyGraphVisitor] Attaching org.apache.hadoop:hadoop-mapreduce-client-jobclient:2.7.1(master) to its parents.
22-Mar-2017 19:46:06 19:46:06.650 [DEBUG] [org.gradle.api.internal.artifacts.ivyservice.resolveengine.graph.ResolvedConfigurationDependencyGraphVisitor] Attaching javax.xml.bind:jaxb-api:2.2.2(runtime) to its parents.
22-Mar-2017 19:46:06 19:46:06.650 [DEBUG] [org.gradle.api.internal.artifacts.ivyservice.resolveengine.graph.ResolvedConfigurationDependencyGraphVisitor] Attaching com.sun.jersey:jersey-client:1.9(runtime) to its parents.
22-Mar-2017 19:46:06 19:46:06.651 [DEBUG] [org.gradle.api.internal.artifacts.ivyservice.resolveengine.graph.ResolvedConfigurationDependencyGraphVisitor] Attaching com.google.inject.extensions:guice-servlet:3.0(runtime) to its parents.
22-Mar-2017 19:46:06 19:46:06.651 [DEBUG] [org.gradle.api.internal.artifacts.ivyservice.resolveengine.graph.ResolvedConfigurationDependencyGraphVisitor] Attaching com.google.inject:guice:3.0(runtime) to its parents.
22-Mar-2017 19:46:06 19:46:06.651 [DEBUG] [org.gradle.api.internal.artifacts.ivyservice.resolveengine.graph.ResolvedConfigurationDependencyGraphVisitor] Attaching com.sun.jersey.contribs:jersey-guice:1.9(runtime) to its parents.
22-Mar-2017 19:46:06 19:46:06.651 [DEBUG] [org.gradle.api.internal.artifacts.ivyservice.resolveengine.graph.ResolvedConfigurationDependencyGraphVisitor] Attaching com.sun.xml.bind:jaxb-impl:2.2.3-1(runtime) to its parents.
22-Mar-2017 19:46:06 19:46:06.651 [DEBUG] [org.gradle.api.internal.artifacts.ivyservice.resolveengine.graph.ResolvedConfigurationDependencyGraphVisitor] Attaching commons-digester:commons-digester:2.1(runtime) to its parents.
22-Mar-2017 19:46:06 19:46:06.651 [DEBUG] [org.gradle.api.internal.artifacts.ivyservice.resolveengine.graph.ResolvedConfigurationDependencyGraphVisitor] Attaching commons-beanutils:commons-beanutils-core:1.8.3(runtime) to its parents.
22-Mar-2017 19:46:06 19:46:06.651 [DEBUG] [org.gradle.api.internal.artifacts.ivyservice.resolveengine.graph.ResolvedConfigurationDependencyGraphVisitor] Attaching com.thoughtworks.paranamer:paranamer:2.3(runtime) to its parents.
22-Mar-2017 19:46:06 19:46:06.651 [DEBUG] [org.gradle.api.internal.artifacts.ivyservice.resolveengine.graph.ResolvedConfigurationDependencyGraphVisitor] Attaching org.xerial.snappy:snappy-java:1.1.0.1(runtime) to its parents.
22-Mar-2017 19:46:06 19:46:06.651 [DEBUG] [org.gradle.api.internal.artifacts.ivyservice.resolveengine.graph.ResolvedConfigurationDependencyGraphVisitor] Attaching org.apache.directory.server:apacheds-kerberos-codec:2.0.0-M15(runtime) to its parents.
22-Mar-2017 19:46:06 19:46:06.651 [DEBUG] [org.gradle.api.internal.artifacts.ivyservice.resolveengine.graph.ResolvedConfigurationDependencyGraphVisitor] Attaching org.apache.curator:curator-framework:2.6.0(runtime) to its parents.
22-Mar-2017 19:46:06 19:46:06.651 [DEBUG] [org.gradle.api.internal.artifacts.ivyservice.resolveengine.graph.ResolvedConfigurationDependencyGraphVisitor] Attaching org.tukaani:xz:1.0(runtime) to its parents.
22-Mar-2017 19:46:06 19:46:06.651 [DEBUG] [org.gradle.api.internal.artifacts.ivyservice.resolveengine.graph.ResolvedConfigurationDependencyGraphVisitor] Attaching org.apache.hadoop:hadoop-hdfs:2.7.1(runtime) to its parents.
22-Mar-2017 19:46:06 19:46:06.651 [DEBUG] [org.gradle.api.internal.artifacts.ivyservice.resolveengine.graph.ResolvedConfigurationDependencyGraphVisitor] Attaching org.apache.hadoop:hadoop-mapreduce-client-core:2.7.1(runtime) to its parents.
22-Mar-2017 19:46:06 19:46:06.652 [DEBUG] [org.gradle.api.internal.artifacts.ivyservice.resolveengine.graph.ResolvedConfigurationDependencyGraphVisitor] Attaching org.springframework.batch:spring-batch-core:3.0.5.RELEASE(runtime) to its parents.
22-Mar-2017 19:46:06 19:46:06.652 [DEBUG] [org.gradle.api.internal.artifacts.ivyservice.resolveengine.graph.ResolvedConfigurationDependencyGraphVisitor] Attaching org.apache.hadoop:hadoop-streaming:2.7.1(runtime) to its parents.
22-Mar-2017 19:46:06 19:46:06.652 [DEBUG] [org.gradle.api.internal.artifacts.ivyservice.resolveengine.graph.ResolvedConfigurationDependencyGraphVisitor] Attaching org.apache.hadoop:hadoop-distcp:2.7.1(runtime) to its parents.
22-Mar-2017 19:46:06 19:46:06.652 [DEBUG] [org.gradle.api.internal.artifacts.ivyservice.resolveengine.graph.ResolvedConfigurationDependencyGraphVisitor] Attaching org.apache.hadoop:hadoop-mapreduce-client-jobclient:2.7.1(runtime) to its parents.
22-Mar-2017 19:46:06 19:46:06.652 [DEBUG] [org.gradle.api.internal.artifacts.ivyservice.resolveengine.graph.ResolvedConfigurationDependencyGraphVisitor] Attaching javax.xml.stream:stax-api:1.0-2(compile) to its parents.
22-Mar-2017 19:46:06 19:46:06.652 [DEBUG] [org.gradle.api.internal.artifacts.ivyservice.resolveengine.graph.ResolvedConfigurationDependencyGraphVisitor] Attaching javax.xml.stream:stax-api:1.0-2(master) to its parents.
22-Mar-2017 19:46:06 19:46:06.652 [DEBUG] [org.gradle.api.internal.artifacts.ivyservice.resolveengine.graph.ResolvedConfigurationDependencyGraphVisitor] Attaching javax.activation:activation:1.1.1(compile) to its parents.
22-Mar-2017 19:46:06 19:46:06.652 [DEBUG] [org.gradle.api.internal.artifacts.ivyservice.resolveengine.graph.ResolvedConfigurationDependencyGraphVisitor] Attaching javax.activation:activation:1.1.1(master) to its parents.
22-Mar-2017 19:46:06 19:46:06.652 [DEBUG] [org.gradle.api.internal.artifacts.ivyservice.resolveengine.graph.ResolvedConfigurationDependencyGraphVisitor] Attaching javax.inject:javax.inject:1(compile) to its parents.
22-Mar-2017 19:46:06 19:46:06.652 [DEBUG] [org.gradle.api.internal.artifacts.ivyservice.resolveengine.graph.ResolvedConfigurationDependencyGraphVisitor] Attaching javax.inject:javax.inject:1(master) to its parents.
22-Mar-2017 19:46:06 19:46:06.652 [DEBUG] [org.gradle.api.internal.artifacts.ivyservice.resolveengine.graph.ResolvedConfigurationDependencyGraphVisitor] Attaching org.sonatype.sisu.inject:cglib:2.2.1-v20090111(compile) to its parents.
22-Mar-2017 19:46:06 19:46:06.652 [DEBUG] [org.gradle.api.internal.artifacts.ivyservice.resolveengine.graph.ResolvedConfigurationDependencyGraphVisitor] Attaching org.sonatype.sisu.inject:cglib:2.2.1-v20090111(master) to its parents.
22-Mar-2017 19:46:06 19:46:06.652 [DEBUG] [org.gradle.api.internal.artifacts.ivyservice.resolveengine.graph.ResolvedConfigurationDependencyGraphVisitor] Attaching commons-beanutils:commons-beanutils:1.9.2(compile) to its parents.
22-Mar-2017 19:46:06 19:46:06.652 [DEBUG] [org.gradle.api.internal.artifacts.ivyservice.resolveengine.graph.ResolvedConfigurationDependencyGraphVisitor] Attaching commons-beanutils:commons-beanutils:1.9.2(master) to its parents.
22-Mar-2017 19:46:06 19:46:06.653 [DEBUG] [org.gradle.api.internal.artifacts.ivyservice.resolveengine.graph.ResolvedConfigurationDependencyGraphVisitor] Attaching org.apache.directory.server:apacheds-i18n:2.0.0-M15(compile) to its parents.
22-Mar-2017 19:46:06 19:46:06.653 [DEBUG] [org.gradle.api.internal.artifacts.ivyservice.resolveengine.graph.ResolvedConfigurationDependencyGraphVisitor] Attaching org.apache.directory.server:apacheds-i18n:2.0.0-M15(master) to its parents.
22-Mar-2017 19:46:06 19:46:06.653 [DEBUG] [org.gradle.api.internal.artifacts.ivyservice.resolveengine.graph.ResolvedConfigurationDependencyGraphVisitor] Attaching org.apache.directory.api:api-asn1-api:1.0.0-M20(compile) to its parents.
22-Mar-2017 19:46:06 19:46:06.653 [DEBUG] [org.gradle.api.internal.artifacts.ivyservice.resolveengine.graph.ResolvedConfigurationDependencyGraphVisitor] Attaching org.apache.directory.api:api-asn1-api:1.0.0-M20(master) to its parents.
22-Mar-2017 19:46:06 19:46:06.653 [DEBUG] [org.gradle.api.internal.artifacts.ivyservice.resolveengine.graph.ResolvedConfigurationDependencyGraphVisitor] Attaching org.apache.directory.api:api-util:1.0.0-M20(compile) to its parents.
22-Mar-2017 19:46:06 19:46:06.653 [DEBUG] [org.gradle.api.internal.artifacts.ivyservice.resolveengine.graph.ResolvedConfigurationDependencyGraphVisitor] Attaching org.apache.directory.api:api-util:1.0.0-M20(master) to its parents.
22-Mar-2017 19:46:06 19:46:06.653 [DEBUG] [org.gradle.api.internal.artifacts.ivyservice.resolveengine.graph.ResolvedConfigurationDependencyGraphVisitor] Attaching commons-daemon:commons-daemon:1.0.13(compile) to its parents.
22-Mar-2017 19:46:06 19:46:06.653 [DEBUG] [org.gradle.api.internal.artifacts.ivyservice.resolveengine.graph.ResolvedConfigurationDependencyGraphVisitor] Attaching commons-daemon:commons-daemon:1.0.13(master) to its parents.
22-Mar-2017 19:46:06 19:46:06.653 [DEBUG] [org.gradle.api.internal.artifacts.ivyservice.resolveengine.graph.ResolvedConfigurationDependencyGraphVisitor] Attaching io.netty:netty-all:4.0.27.Final(compile) to its parents.
22-Mar-2017 19:46:06 19:46:06.653 [DEBUG] [org.gradle.api.internal.artifacts.ivyservice.resolveengine.graph.ResolvedConfigurationDependencyGraphVisitor] Attaching io.netty:netty-all:4.0.27.Final(master) to its parents.
22-Mar-2017 19:46:06 19:46:06.653 [DEBUG] [org.gradle.api.internal.artifacts.ivyservice.resolveengine.graph.ResolvedConfigurationDependencyGraphVisitor] Attaching xerces:xercesImpl:2.9.1(compile) to its parents.
22-Mar-2017 19:46:06 19:46:06.653 [DEBUG] [org.gradle.api.internal.artifacts.ivyservice.resolveengine.graph.ResolvedConfigurationDependencyGraphVisitor] Attaching xerces:xercesImpl:2.9.1(master) to its parents.
22-Mar-2017 19:46:06 19:46:06.653 [DEBUG] [org.gradle.api.internal.artifacts.ivyservice.resolveengine.graph.ResolvedConfigurationDependencyGraphVisitor] Attaching org.fusesource.leveldbjni:leveldbjni-all:1.8(compile) to its parents.
22-Mar-2017 19:46:06 19:46:06.653 [DEBUG] [org.gradle.api.internal.artifacts.ivyservice.resolveengine.graph.ResolvedConfigurationDependencyGraphVisitor] Attaching org.fusesource.leveldbjni:leveldbjni-all:1.8(master) to its parents.
22-Mar-2017 19:46:06 19:46:06.654 [DEBUG] [org.gradle.api.internal.artifacts.ivyservice.resolveengine.graph.ResolvedConfigurationDependencyGraphVisitor] Attaching org.apache.hadoop:hadoop-mapreduce-client-common:2.7.1(compile) to its parents.
22-Mar-2017 19:46:06 19:46:06.654 [DEBUG] [org.gradle.api.internal.artifacts.ivyservice.resolveengine.graph.ResolvedConfigurationDependencyGraphVisitor] Attaching org.apache.hadoop:hadoop-mapreduce-client-common:2.7.1(master) to its parents.
22-Mar-2017 19:46:06 19:46:06.654 [DEBUG] [org.gradle.api.internal.artifacts.ivyservice.resolveengine.graph.ResolvedConfigurationDependencyGraphVisitor] Attaching org.apache.hadoop:hadoop-mapreduce-client-shuffle:2.7.1(compile) to its parents.
22-Mar-2017 19:46:06 19:46:06.654 [DEBUG] [org.gradle.api.internal.artifacts.ivyservice.resolveengine.graph.ResolvedConfigurationDependencyGraphVisitor] Attaching org.apache.hadoop:hadoop-mapreduce-client-shuffle:2.7.1(master) to its parents.
22-Mar-2017 19:46:06 19:46:06.654 [DEBUG] [org.gradle.api.internal.artifacts.ivyservice.resolveengine.graph.ResolvedConfigurationDependencyGraphVisitor] Attaching javax.xml.stream:stax-api:1.0-2(runtime) to its parents.
22-Mar-2017 19:46:06 19:46:06.654 [DEBUG] [org.gradle.api.internal.artifacts.ivyservice.resolveengine.graph.ResolvedConfigurationDependencyGraphVisitor] Attaching javax.activation:activation:1.1.1(runtime) to its parents.
22-Mar-2017 19:46:06 19:46:06.654 [DEBUG] [org.gradle.api.internal.artifacts.ivyservice.resolveengine.graph.ResolvedConfigurationDependencyGraphVisitor] Attaching javax.inject:javax.inject:1(runtime) to its parents.
22-Mar-2017 19:46:06 19:46:06.654 [DEBUG] [org.gradle.api.internal.artifacts.ivyservice.resolveengine.graph.ResolvedConfigurationDependencyGraphVisitor] Attaching org.sonatype.sisu.inject:cglib:2.2.1-v20090111(runtime) to its parents.
22-Mar-2017 19:46:06 19:46:06.654 [DEBUG] [org.gradle.api.internal.artifacts.ivyservice.resolveengine.graph.ResolvedConfigurationDependencyGraphVisitor] Attaching commons-beanutils:commons-beanutils:1.9.2(runtime) to its parents.
22-Mar-2017 19:46:06 19:46:06.654 [DEBUG] [org.gradle.api.internal.artifacts.ivyservice.resolveengine.graph.ResolvedConfigurationDependencyGraphVisitor] Attaching org.apache.directory.server:apacheds-i18n:2.0.0-M15(runtime) to its parents.
22-Mar-2017 19:46:06 19:46:06.654 [DEBUG] [org.gradle.api.internal.artifacts.ivyservice.resolveengine.graph.ResolvedConfigurationDependencyGraphVisitor] Attaching org.apache.directory.api:api-asn1-api:1.0.0-M20(runtime) to its parents.
22-Mar-2017 19:46:06 19:46:06.654 [DEBUG] [org.gradle.api.internal.artifacts.ivyservice.resolveengine.graph.ResolvedConfigurationDependencyGraphVisitor] Attaching org.apache.directory.api:api-util:1.0.0-M20(runtime) to its parents.
22-Mar-2017 19:46:06 19:46:06.654 [DEBUG] [org.gradle.api.internal.artifacts.ivyservice.resolveengine.graph.ResolvedConfigurationDependencyGraphVisitor] Attaching commons-daemon:commons-daemon:1.0.13(runtime) to its parents.
22-Mar-2017 19:46:06 19:46:06.654 [DEBUG] [org.gradle.api.internal.artifacts.ivyservice.resolveengine.graph.ResolvedConfigurationDependencyGraphVisitor] Attaching io.netty:netty-all:4.0.27.Final(runtime) to its parents.
22-Mar-2017 19:46:06 19:46:06.654 [DEBUG] [org.gradle.api.internal.artifacts.ivyservice.resolveengine.graph.ResolvedConfigurationDependencyGraphVisitor] Attaching xerces:xercesImpl:2.9.1(runtime) to its parents.
22-Mar-2017 19:46:06 19:46:06.655 [DEBUG] [org.gradle.api.internal.artifacts.ivyservice.resolveengine.graph.ResolvedConfigurationDependencyGraphVisitor] Attaching org.fusesource.leveldbjni:leveldbjni-all:1.8(runtime) to its parents.
22-Mar-2017 19:46:06 19:46:06.655 [DEBUG] [org.gradle.api.internal.artifacts.ivyservice.resolveengine.graph.ResolvedConfigurationDependencyGraphVisitor] Attaching org.apache.hadoop:hadoop-mapreduce-client-common:2.7.1(runtime) to its parents.
22-Mar-2017 19:46:06 19:46:06.655 [DEBUG] [org.gradle.api.internal.artifacts.ivyservice.resolveengine.graph.ResolvedConfigurationDependencyGraphVisitor] Attaching org.apache.hadoop:hadoop-mapreduce-client-shuffle:2.7.1(runtime) to its parents.
22-Mar-2017 19:46:06 19:46:06.655 [DEBUG] [org.gradle.api.internal.artifacts.ivyservice.resolveengine.graph.ResolvedConfigurationDependencyGraphVisitor] Attaching asm:asm:3.1(compile) to its parents.
22-Mar-2017 19:46:06 19:46:06.655 [DEBUG] [org.gradle.api.internal.artifacts.ivyservice.resolveengine.graph.ResolvedConfigurationDependencyGraphVisitor] Attaching asm:asm:3.1(master) to its parents.
22-Mar-2017 19:46:06 19:46:06.655 [DEBUG] [org.gradle.api.internal.artifacts.ivyservice.resolveengine.graph.ResolvedConfigurationDependencyGraphVisitor] Attaching xml-apis:xml-apis:1.3.04(compile) to its parents.
22-Mar-2017 19:46:06 19:46:06.655 [DEBUG] [org.gradle.api.internal.artifacts.ivyservice.resolveengine.graph.ResolvedConfigurationDependencyGraphVisitor] Attaching xml-apis:xml-apis:1.3.04(master) to its parents.
22-Mar-2017 19:46:06 19:46:06.655 [DEBUG] [org.gradle.api.internal.artifacts.ivyservice.resolveengine.graph.ResolvedConfigurationDependencyGraphVisitor] Attaching org.apache.hadoop:hadoop-yarn-server-common:2.7.1(compile) to its parents.
22-Mar-2017 19:46:06 19:46:06.655 [DEBUG] [org.gradle.api.internal.artifacts.ivyservice.resolveengine.graph.ResolvedConfigurationDependencyGraphVisitor] Attaching org.apache.hadoop:hadoop-yarn-server-common:2.7.1(master) to its parents.
22-Mar-2017 19:46:06 19:46:06.655 [DEBUG] [org.gradle.api.internal.artifacts.ivyservice.resolveengine.graph.ResolvedConfigurationDependencyGraphVisitor] Attaching org.apache.hadoop:hadoop-yarn-server-nodemanager:2.7.1(compile) to its parents.
22-Mar-2017 19:46:06 19:46:06.655 [DEBUG] [org.gradle.api.internal.artifacts.ivyservice.resolveengine.graph.ResolvedConfigurationDependencyGraphVisitor] Attaching org.apache.hadoop:hadoop-yarn-server-nodemanager:2.7.1(master) to its parents.
22-Mar-2017 19:46:06 19:46:06.655 [DEBUG] [org.gradle.api.internal.artifacts.ivyservice.resolveengine.graph.ResolvedConfigurationDependencyGraphVisitor] Attaching asm:asm:3.1(runtime) to its parents.
22-Mar-2017 19:46:06 19:46:06.656 [DEBUG] [org.gradle.api.internal.artifacts.ivyservice.resolveengine.graph.ResolvedConfigurationDependencyGraphVisitor] Attaching xml-apis:xml-apis:1.3.04(runtime) to its parents.
22-Mar-2017 19:46:06 19:46:06.656 [DEBUG] [org.gradle.api.internal.artifacts.ivyservice.resolveengine.graph.ResolvedConfigurationDependencyGraphVisitor] Attaching org.apache.hadoop:hadoop-yarn-server-common:2.7.1(runtime) to its parents.
22-Mar-2017 19:46:06 19:46:06.656 [DEBUG] [org.gradle.api.internal.artifacts.ivyservice.resolveengine.graph.ResolvedConfigurationDependencyGraphVisitor] Attaching org.apache.hadoop:hadoop-yarn-server-nodemanager:2.7.1(runtime) to its parents.
22-Mar-2017 19:46:06 19:46:06.656 [DEBUG] [org.gradle.api.internal.artifacts.ivyservice.resolveengine.graph.ResolvedConfigurationDependencyGraphVisitor] Attaching org.codehaus.plexus:plexus-utils:3.0.17(runtime) to its parents.
22-Mar-2017 19:46:06 19:46:06.656 [DEBUG] [org.gradle.api.internal.artifacts.ivyservice.resolveengine.graph.ResolvedConfigurationDependencyGraphVisitor] Attaching org.codehaus.jackson:jackson-jaxrs:1.9.13(runtime) to its parents.
22-Mar-2017 19:46:06 19:46:06.656 [DEBUG] [org.gradle.api.internal.artifacts.ivyservice.resolveengine.graph.ResolvedConfigurationDependencyGraphVisitor] Attaching org.codehaus.jackson:jackson-xc:1.9.13(runtime) to its parents.
22-Mar-2017 19:46:06 19:46:06.656 [DEBUG] [org.gradle.api.internal.artifacts.ivyservice.resolveengine.graph.ResolvedConfigurationDependencyGraphVisitor] Attaching com.google.guava:guava:16.0.1(compile) to its parents.
22-Mar-2017 19:46:06 19:46:06.656 [DEBUG] [org.gradle.api.internal.artifacts.ivyservice.resolveengine.graph.ResolvedConfigurationDependencyGraphVisitor] Attaching com.google.guava:guava:16.0.1(master) to its parents.
22-Mar-2017 19:46:06 19:46:06.656 [DEBUG] [org.gradle.api.internal.artifacts.ivyservice.resolveengine.graph.ResolvedConfigurationDependencyGraphVisitor] Attaching com.google.guava:guava:16.0.1(runtime) to its parents.
22-Mar-2017 19:46:06 19:46:06.656 [DEBUG] [org.gradle.api.internal.artifacts.ivyservice.resolveengine.oldresult.TransientConfigurationResultsBuilder] Flushing resolved configuration data in Binary store in /tmp/gradle7069436072086219281.bin. Wrote root org.springframework.xd:spring-xd-yarn-client:1.3.3.BUILD-SNAPSHOT:default.
22-Mar-2017 19:46:06 19:46:06.663 [DEBUG] [org.gradle.api.internal.artifacts.ivyservice.resolveengine.oldresult.TransientConfigurationResultsBuilder] Loaded resolved configuration results (0.007 secs) from Binary store in /tmp/gradle7069436072086219281.bin
22-Mar-2017 19:46:06 19:46:06.671 [DEBUG] [org.gradle.api.internal.artifacts.ivyservice.resolveengine.oldresult.TransientConfigurationResultsBuilder] Loaded resolved configuration results (0.007 secs) from Binary store in /tmp/gradle7069436072086219281.bin
22-Mar-2017 19:46:06 19:46:06.693 [DEBUG] [org.gradle.api.internal.tasks.execution.ExecuteAtMostOnceTaskExecuter] Finished executing task ':spring-xd-yarn:spring-xd-yarn-client:generatePomFileForMavenCustomPublication'
22-Mar-2017 19:46:06 19:46:06.693 [INFO] [org.gradle.execution.taskgraph.AbstractTaskPlanExecutor] :spring-xd-yarn:spring-xd-yarn-client:generatePomFileForMavenCustomPublication (Thread[main,5,main]) completed. Took 0.23 secs.
22-Mar-2017 19:46:06 19:46:06.694 [INFO] [org.gradle.execution.taskgraph.AbstractTaskPlanExecutor] :spring-xd-yarn:spring-xd-yarn-client:javadocMaven (Thread[main,5,main]) started.
22-Mar-2017 19:46:06 19:46:06.694 [LIFECYCLE] [class org.gradle.TaskExecutionLogger] :spring-xd-yarn:spring-xd-yarn-client:javadocMaven
22-Mar-2017 19:46:06 19:46:06.694 [DEBUG] [org.gradle.api.internal.tasks.execution.ExecuteAtMostOnceTaskExecuter] Starting to execute task ':spring-xd-yarn:spring-xd-yarn-client:javadocMaven'
22-Mar-2017 19:46:06 19:46:06.694 [DEBUG] [org.gradle.api.internal.tasks.execution.SkipUpToDateTaskExecuter] Determining if task ':spring-xd-yarn:spring-xd-yarn-client:javadocMaven' is up-to-date
22-Mar-2017 19:46:06 19:46:06.705 [INFO] [org.gradle.api.internal.tasks.execution.SkipUpToDateTaskExecuter] Executing task ':spring-xd-yarn:spring-xd-yarn-client:javadocMaven' (up-to-date check took 0.011 secs) due to:
22-Mar-2017 19:46:06   No history is available.
22-Mar-2017 19:46:06 19:46:06.705 [DEBUG] [org.gradle.api.internal.tasks.execution.ExecuteActionsTaskExecuter] Executing actions for task ':spring-xd-yarn:spring-xd-yarn-client:javadocMaven'.
22-Mar-2017 19:46:06 19:46:06.748 [DEBUG] [org.gradle.api.internal.tasks.execution.ExecuteAtMostOnceTaskExecuter] Finished executing task ':spring-xd-yarn:spring-xd-yarn-client:javadocMaven'
22-Mar-2017 19:46:06 19:46:06.749 [INFO] [org.gradle.execution.taskgraph.AbstractTaskPlanExecutor] :spring-xd-yarn:spring-xd-yarn-client:javadocMaven (Thread[main,5,main]) completed. Took 0.055 secs.
22-Mar-2017 19:46:06 19:46:06.749 [INFO] [org.gradle.execution.taskgraph.AbstractTaskPlanExecutor] :spring-xd-yarn:spring-xd-yarn-client:sourceJar (Thread[main,5,main]) started.
22-Mar-2017 19:46:06 19:46:06.749 [LIFECYCLE] [class org.gradle.TaskExecutionLogger] :spring-xd-yarn:spring-xd-yarn-client:sourceJar
22-Mar-2017 19:46:06 19:46:06.749 [DEBUG] [org.gradle.api.internal.tasks.execution.ExecuteAtMostOnceTaskExecuter] Starting to execute task ':spring-xd-yarn:spring-xd-yarn-client:sourceJar'
22-Mar-2017 19:46:06 19:46:06.755 [DEBUG] [org.gradle.api.internal.tasks.execution.SkipUpToDateTaskExecuter] Determining if task ':spring-xd-yarn:spring-xd-yarn-client:sourceJar' is up-to-date
22-Mar-2017 19:46:06 19:46:06.757 [INFO] [org.gradle.api.internal.tasks.execution.SkipUpToDateTaskExecuter] Executing task ':spring-xd-yarn:spring-xd-yarn-client:sourceJar' (up-to-date check took 0.002 secs) due to:
22-Mar-2017 19:46:06   No history is available.
22-Mar-2017 19:46:06 19:46:06.757 [DEBUG] [org.gradle.api.internal.tasks.execution.ExecuteActionsTaskExecuter] Executing actions for task ':spring-xd-yarn:spring-xd-yarn-client:sourceJar'.
22-Mar-2017 19:46:06 19:46:06.764 [DEBUG] [org.gradle.api.internal.tasks.execution.ExecuteAtMostOnceTaskExecuter] Finished executing task ':spring-xd-yarn:spring-xd-yarn-client:sourceJar'
22-Mar-2017 19:46:06 19:46:06.764 [INFO] [org.gradle.execution.taskgraph.AbstractTaskPlanExecutor] :spring-xd-yarn:spring-xd-yarn-client:sourceJar (Thread[main,5,main]) completed. Took 0.015 secs.
22-Mar-2017 19:46:06 19:46:06.765 [INFO] [org.gradle.execution.taskgraph.AbstractTaskPlanExecutor] :spring-xd-yarn:spring-xd-yarn-client:artifactoryPublish (Thread[main,5,main]) started.
22-Mar-2017 19:46:06 19:46:06.765 [LIFECYCLE] [class org.gradle.TaskExecutionLogger] :spring-xd-yarn:spring-xd-yarn-client:artifactoryPublish
22-Mar-2017 19:46:06 19:46:06.765 [DEBUG] [org.gradle.api.internal.tasks.execution.ExecuteAtMostOnceTaskExecuter] Starting to execute task ':spring-xd-yarn:spring-xd-yarn-client:artifactoryPublish'
22-Mar-2017 19:46:06 19:46:06.765 [DEBUG] [org.gradle.api.internal.tasks.execution.SkipUpToDateTaskExecuter] Determining if task ':spring-xd-yarn:spring-xd-yarn-client:artifactoryPublish' is up-to-date
22-Mar-2017 19:46:06 19:46:06.765 [INFO] [org.gradle.api.internal.tasks.execution.SkipUpToDateTaskExecuter] Executing task ':spring-xd-yarn:spring-xd-yarn-client:artifactoryPublish' (up-to-date check took 0.0 secs) due to:
22-Mar-2017 19:46:06   Task has not declared any outputs.
22-Mar-2017 19:46:06 19:46:06.765 [DEBUG] [org.gradle.api.internal.tasks.execution.ExecuteActionsTaskExecuter] Executing actions for task ':spring-xd-yarn:spring-xd-yarn-client:artifactoryPublish'.
22-Mar-2017 19:46:06 19:46:06.765 [DEBUG] [org.jfrog.gradle.plugin.artifactory.task.BuildInfoBaseTask] Task ':spring-xd-yarn:spring-xd-yarn-client:artifactoryPublish' activated
22-Mar-2017 19:46:06 19:46:06.765 [DEBUG] [org.gradle.api.internal.tasks.execution.ExecuteAtMostOnceTaskExecuter] Finished executing task ':spring-xd-yarn:spring-xd-yarn-client:artifactoryPublish'
22-Mar-2017 19:46:06 19:46:06.765 [INFO] [org.gradle.execution.taskgraph.AbstractTaskPlanExecutor] :spring-xd-yarn:spring-xd-yarn-client:artifactoryPublish (Thread[main,5,main]) completed. Took 0.0 secs.
22-Mar-2017 19:46:06 19:46:06.765 [INFO] [org.gradle.execution.taskgraph.AbstractTaskPlanExecutor] :spring-xd-yarn:artifactoryPublish (Thread[main,5,main]) started.
22-Mar-2017 19:46:06 19:46:06.765 [LIFECYCLE] [class org.gradle.TaskExecutionLogger] :spring-xd-yarn:artifactoryPublish
22-Mar-2017 19:46:06 19:46:06.765 [DEBUG] [org.gradle.api.internal.tasks.execution.ExecuteAtMostOnceTaskExecuter] Starting to execute task ':spring-xd-yarn:artifactoryPublish'
22-Mar-2017 19:46:06 19:46:06.765 [DEBUG] [org.gradle.api.internal.tasks.execution.SkipUpToDateTaskExecuter] Determining if task ':spring-xd-yarn:artifactoryPublish' is up-to-date
22-Mar-2017 19:46:06 19:46:06.766 [INFO] [org.gradle.api.internal.tasks.execution.SkipUpToDateTaskExecuter] Executing task ':spring-xd-yarn:artifactoryPublish' (up-to-date check took 0.0 secs) due to:
22-Mar-2017 19:46:06   Task has not declared any outputs.
22-Mar-2017 19:46:06 19:46:06.766 [DEBUG] [org.gradle.api.internal.tasks.execution.ExecuteActionsTaskExecuter] Executing actions for task ':spring-xd-yarn:artifactoryPublish'.
22-Mar-2017 19:46:06 19:46:06.766 [DEBUG] [org.jfrog.gradle.plugin.artifactory.task.BuildInfoBaseTask] Task ':spring-xd-yarn:artifactoryPublish' activated
22-Mar-2017 19:46:06 19:46:06.766 [DEBUG] [org.gradle.api.internal.tasks.execution.ExecuteAtMostOnceTaskExecuter] Finished executing task ':spring-xd-yarn:artifactoryPublish'
22-Mar-2017 19:46:06 19:46:06.766 [INFO] [org.gradle.execution.taskgraph.AbstractTaskPlanExecutor] :spring-xd-yarn:artifactoryPublish (Thread[main,5,main]) completed. Took 0.001 secs.
22-Mar-2017 19:46:06 19:46:06.766 [INFO] [org.gradle.execution.taskgraph.AbstractTaskPlanExecutor] :artifactoryPublish (Thread[main,5,main]) started.
22-Mar-2017 19:46:06 19:46:06.766 [LIFECYCLE] [class org.gradle.TaskExecutionLogger] :artifactoryPublish
22-Mar-2017 19:46:06 19:46:06.766 [DEBUG] [org.gradle.api.internal.tasks.execution.ExecuteAtMostOnceTaskExecuter] Starting to execute task ':artifactoryPublish'
22-Mar-2017 19:46:06 19:46:06.766 [DEBUG] [org.gradle.api.internal.tasks.execution.SkipUpToDateTaskExecuter] Determining if task ':artifactoryPublish' is up-to-date
22-Mar-2017 19:46:06 19:46:06.766 [INFO] [org.gradle.api.internal.tasks.execution.SkipUpToDateTaskExecuter] Executing task ':artifactoryPublish' (up-to-date check took 0.0 secs) due to:
22-Mar-2017 19:46:06   Task has not declared any outputs.
22-Mar-2017 19:46:06 19:46:06.766 [DEBUG] [org.gradle.api.internal.tasks.execution.ExecuteActionsTaskExecuter] Executing actions for task ':artifactoryPublish'.
22-Mar-2017 19:46:06 19:46:06.767 [DEBUG] [org.jfrog.gradle.plugin.artifactory.task.BuildInfoBaseTask] Task ':artifactoryPublish' activated
22-Mar-2017 19:46:06 19:46:06.767 [DEBUG] [org.jfrog.gradle.plugin.artifactory.task.BuildInfoBaseTask] Starting build info extraction for project ':' using last task in graph ':artifactoryPublish'
22-Mar-2017 19:46:06 19:46:06.767 [DEBUG] [org.jfrog.gradle.plugin.artifactory.task.BuildInfoBaseTask] Context URL for deployment 'https://repo.spring.io
22-Mar-2017 19:46:06 19:46:06.767 [INFO] [org.jfrog.gradle.plugin.artifactory.task.BuildInfoPublicationsTask] No publications to publish for project ':documentation-toolchain'.
22-Mar-2017 19:46:21 19:46:21.804 [DEBUG] [org.jfrog.gradle.plugin.artifactory.task.BuildInfoBaseTask] Uploading artifacts to Artifactory at 'https://repo.spring.io'
22-Mar-2017 19:46:21 19:46:21.813 [LIFECYCLE] [org.jfrog.gradle.plugin.artifactory.task.BuildInfoBaseTask] Deploying artifact: https://repo.spring.io/libs-snapshot-local/org/springframework/xd/spring-xd-extension-header-enricher/1.3.3.BUILD-SNAPSHOT/spring-xd-extension-header-enricher-1.3.3.BUILD-SNAPSHOT.jar
22-Mar-2017 19:46:21 19:46:21.835 [DEBUG] [org.jfrog.gradle.plugin.artifactory.task.BuildInfoBaseTask] Skipping checksum deploy of file size 374 , falling back to regular deployment.
22-Mar-2017 19:46:21 19:46:21.854 [DEBUG] [org.jfrog.gradle.plugin.artifactory.task.BuildInfoBaseTask] Full Artifact Http path: PUT https://repo.spring.io/libs-snapshot-local/org/springframework/xd/spring-xd-extension-header-enricher/1.3.3.BUILD-SNAPSHOT/spring-xd-extension-header-enricher-1.3.3.BUILD-SNAPSHOT.jar;build.name=Spring%20XD%20-%20Publish-II%20-%20Build%20and%20install%20XD;build.timestamp=1490211238091;build.number=8;vcs.revision=ec106725c51d245109b2e5055d9f65e43228ecc1 HTTP/1.1
22-Mar-2017 19:46:21 @Http Headers: [X-Checksum-Sha1: 910c6088bc38ea0c9a73bb961a886ce4daf6ed79, X-Checksum-Md5: 017cc201c10e6b5656a33fbe14f09b35]
22-Mar-2017 19:46:21 19:46:21.962 [DEBUG] [org.apache.http.impl.conn.BasicClientConnectionManager] Get connection for route {s}->https://repo.spring.io
22-Mar-2017 19:46:21 19:46:21.999 [DEBUG] [org.apache.http.impl.conn.DefaultClientConnectionOperator] Connecting to repo.spring.io:443
22-Mar-2017 19:46:22 19:46:22.087 [DEBUG] [org.apache.http.client.protocol.RequestAddCookies] CookieSpec selected: best-match
22-Mar-2017 19:46:22 19:46:22.103 [DEBUG] [org.apache.http.client.protocol.RequestAuthCache] Auth cache not set in the context
22-Mar-2017 19:46:22 19:46:22.103 [DEBUG] [org.apache.http.client.protocol.RequestTargetAuthentication] Target auth state: UNCHALLENGED
22-Mar-2017 19:46:22 19:46:22.110 [DEBUG] [org.apache.http.client.protocol.RequestProxyAuthentication] Proxy auth state: UNCHALLENGED
22-Mar-2017 19:46:22 19:46:22.110 [DEBUG] [org.apache.http.impl.client.DefaultHttpClient] Attempt 1 to execute request
22-Mar-2017 19:46:22 19:46:22.111 [DEBUG] [org.apache.http.impl.conn.DefaultClientConnection] Sending request: PUT /libs-snapshot-local/org/springframework/xd/spring-xd-extension-header-enricher/1.3.3.BUILD-SNAPSHOT/spring-xd-extension-header-enricher-1.3.3.BUILD-SNAPSHOT.jar;build.name=Spring%20XD%20-%20Publish-II%20-%20Build%20and%20install%20XD;build.timestamp=1490211238091;build.number=8;vcs.revision=ec106725c51d245109b2e5055d9f65e43228ecc1 HTTP/1.1
22-Mar-2017 19:46:22 19:46:22.112 [DEBUG] [org.apache.http.headers] >> PUT /libs-snapshot-local/org/springframework/xd/spring-xd-extension-header-enricher/1.3.3.BUILD-SNAPSHOT/spring-xd-extension-header-enricher-1.3.3.BUILD-SNAPSHOT.jar;build.name=Spring%20XD%20-%20Publish-II%20-%20Build%20and%20install%20XD;build.timestamp=1490211238091;build.number=8;vcs.revision=ec106725c51d245109b2e5055d9f65e43228ecc1 HTTP/1.1
22-Mar-2017 19:46:22 19:46:22.112 [DEBUG] [org.apache.http.headers] >> X-Checksum-Sha1: 910c6088bc38ea0c9a73bb961a886ce4daf6ed79
22-Mar-2017 19:46:22 19:46:22.112 [DEBUG] [org.apache.http.headers] >> X-Checksum-Md5: 017cc201c10e6b5656a33fbe14f09b35
22-Mar-2017 19:46:22 19:46:22.112 [DEBUG] [org.apache.http.headers] >> Expect: 100-continue
22-Mar-2017 19:46:22 19:46:22.112 [DEBUG] [org.apache.http.headers] >> Content-Length: 374
22-Mar-2017 19:46:22 19:46:22.112 [DEBUG] [org.apache.http.headers] >> Content-Type: binary/octet-stream
22-Mar-2017 19:46:22 19:46:22.112 [DEBUG] [org.apache.http.headers] >> Host: repo.spring.io
22-Mar-2017 19:46:22 19:46:22.112 [DEBUG] [org.apache.http.headers] >> Connection: Keep-Alive
22-Mar-2017 19:46:22 19:46:22.112 [DEBUG] [org.apache.http.headers] >> User-Agent: ArtifactoryBuildClient/2.5.1
22-Mar-2017 19:46:22 19:46:22.112 [DEBUG] [org.apache.http.headers] >> Authorization: Basic YnVpbGRtYXN0ZXI6QVBCOWI3ZWRrYndTUGRqa3F5Y2FZS1dNZDFS
22-Mar-2017 19:46:22 19:46:22.202 [DEBUG] [org.apache.http.impl.conn.DefaultClientConnection] Receiving response: HTTP/1.1 100 Continue
22-Mar-2017 19:46:22 19:46:22.202 [DEBUG] [org.apache.http.headers] << HTTP/1.1 100 Continue
22-Mar-2017 19:46:22 19:46:22.340 [DEBUG] [org.apache.http.impl.conn.DefaultClientConnection] Receiving response: HTTP/1.1 401 Unauthorized
22-Mar-2017 19:46:22 19:46:22.340 [DEBUG] [org.apache.http.headers] << HTTP/1.1 401 Unauthorized
22-Mar-2017 19:46:22 19:46:22.340 [DEBUG] [org.apache.http.headers] << Date: Wed, 22 Mar 2017 19:46:22 GMT
22-Mar-2017 19:46:22 19:46:22.340 [DEBUG] [org.apache.http.headers] << Alt-Svc: clear
22-Mar-2017 19:46:22 19:46:22.340 [DEBUG] [org.apache.http.headers] << Transfer-Encoding: chunked
22-Mar-2017 19:46:22 19:46:22.347 [DEBUG] [org.apache.http.impl.client.DefaultHttpClient] Connection can be kept alive indefinitely
22-Mar-2017 19:46:22 19:46:22.347 [DEBUG] [org.apache.http.impl.client.DefaultHttpClient] Authentication required
22-Mar-2017 19:46:22 19:46:22.348 [DEBUG] [org.apache.http.impl.client.DefaultHttpClient] repo.spring.io:443 requested authentication
22-Mar-2017 19:46:22 19:46:22.348 [DEBUG] [org.apache.http.impl.client.DefaultHttpClient] Response contains no authentication challenges
22-Mar-2017 19:47:27 19:47:27.342 [DEBUG] [org.apache.http.impl.conn.BasicClientConnectionManager] Releasing connection org.apache.http.impl.conn.ManagedClientConnectionImpl@55cca370
22-Mar-2017 19:47:27 19:47:27.342 [DEBUG] [org.apache.http.impl.conn.BasicClientConnectionManager] Connection can be kept alive indefinitely
22-Mar-2017 19:47:27 19:47:27.742 [ERROR] [org.jfrog.gradle.plugin.artifactory.task.BuildInfoBaseTask] Failed while reading the response from: PUT https://repo.spring.io/libs-snapshot-local/org/springframework/xd/spring-xd-extension-header-enricher/1.3.3.BUILD-SNAPSHOT/spring-xd-extension-header-enricher-1.3.3.BUILD-SNAPSHOT.jar;build.name=Spring%20XD%20-%20Publish-II%20-%20Build%20and%20install%20XD;build.timestamp=1490211238091;build.number=8;vcs.revision=ec106725c51d245109b2e5055d9f65e43228ecc1 HTTP/1.1
22-Mar-2017 19:47:27 org.codehaus.jackson.JsonParseException: Unexpected character ('D' (code 68)): expected a valid value (number, String, array, object, 'true', 'false' or 'null')
22-Mar-2017 19:47:27 at [Source: java.io.StringReader@4bf75d01; line: 1, column: 2]
22-Mar-2017 19:47:27         at org.codehaus.jackson.JsonParser._constructError(JsonParser.java:1433)
22-Mar-2017 19:47:27         at org.codehaus.jackson.impl.JsonParserMinimalBase._reportError(JsonParserMinimalBase.java:521)
22-Mar-2017 19:47:27         at org.codehaus.jackson.impl.JsonParserMinimalBase._reportUnexpectedChar(JsonParserMinimalBase.java:442)
22-Mar-2017 19:47:27         at org.codehaus.jackson.impl.ReaderBasedParser._handleUnexpectedValue(ReaderBasedParser.java:1198)
22-Mar-2017 19:47:27         at org.codehaus.jackson.impl.ReaderBasedParser.nextToken(ReaderBasedParser.java:485)
22-Mar-2017 19:47:27         at org.codehaus.jackson.map.ObjectMapper._initForReading(ObjectMapper.java:2770)
22-Mar-2017 19:47:27         at org.codehaus.jackson.map.ObjectMapper._readValue(ObjectMapper.java:2691)
22-Mar-2017 19:47:27         at org.codehaus.jackson.map.ObjectMapper.readValue(ObjectMapper.java:1286)
22-Mar-2017 19:47:27         at org.codehaus.jackson.JsonParser.readValueAs(JsonParser.java:1337)
22-Mar-2017 19:47:27         at org.jfrog.build.client.ArtifactoryHttpClient.execute(ArtifactoryHttpClient.java:209)
22-Mar-2017 19:47:27         at org.jfrog.build.client.ArtifactoryHttpClient.upload(ArtifactoryHttpClient.java:195)
22-Mar-2017 19:47:27         at org.jfrog.build.extractor.clientConfiguration.client.ArtifactoryBuildInfoClient.uploadFile(ArtifactoryBuildInfoClient.java:619)
22-Mar-2017 19:47:27         at org.jfrog.build.extractor.clientConfiguration.client.ArtifactoryBuildInfoClient.deployArtifact(ArtifactoryBuildInfoClient.java:330)
22-Mar-2017 19:47:27         at org.jfrog.gradle.plugin.artifactory.task.BuildInfoBaseTask.deployArtifacts(BuildInfoBaseTask.java:409)
22-Mar-2017 19:47:27         at org.jfrog.gradle.plugin.artifactory.task.BuildInfoBaseTask.prepareAndDeploy(BuildInfoBaseTask.java:284)
22-Mar-2017 19:47:27         at org.jfrog.gradle.plugin.artifactory.task.BuildInfoBaseTask.collectProjectBuildInfo(BuildInfoBaseTask.java:363)
22-Mar-2017 19:47:27         at sun.reflect.GeneratedMethodAccessor667.invoke(Unknown Source)
22-Mar-2017 19:47:27         at sun.reflect.DelegatingMethodAccessorImpl.invoke(DelegatingMethodAccessorImpl.java:43)
22-Mar-2017 19:47:27         at java.lang.reflect.Method.invoke(Method.java:606)
22-Mar-2017 19:47:27         at org.gradle.internal.reflect.JavaMethod.invoke(JavaMethod.java:63)
22-Mar-2017 19:47:27         at org.gradle.api.internal.project.taskfactory.AnnotationProcessingTaskFactory$StandardTaskAction.doExecute(AnnotationProcessingTaskFactory.java:218)
22-Mar-2017 19:47:27         at org.gradle.api.internal.project.taskfactory.AnnotationProcessingTaskFactory$StandardTaskAction.execute(AnnotationProcessingTaskFactory.java:211)
22-Mar-2017 19:47:27         at org.gradle.api.internal.project.taskfactory.AnnotationProcessingTaskFactory$StandardTaskAction.execute(AnnotationProcessingTaskFactory.java:200)
22-Mar-2017 19:47:27         at org.gradle.api.internal.AbstractTask$TaskActionWrapper.execute(AbstractTask.java:579)
22-Mar-2017 19:47:27         at org.gradle.api.internal.AbstractTask$TaskActionWrapper.execute(AbstractTask.java:562)
22-Mar-2017 19:47:27         at org.gradle.api.internal.tasks.execution.ExecuteActionsTaskExecuter.executeAction(ExecuteActionsTaskExecuter.java:80)
22-Mar-2017 19:47:27         at org.gradle.api.internal.tasks.execution.ExecuteActionsTaskExecuter.executeActions(ExecuteActionsTaskExecuter.java:61)
22-Mar-2017 19:47:27         at org.gradle.api.internal.tasks.execution.ExecuteActionsTaskExecuter.execute(ExecuteActionsTaskExecuter.java:46)
22-Mar-2017 19:47:27         at org.gradle.api.internal.tasks.execution.PostExecutionAnalysisTaskExecuter.execute(PostExecutionAnalysisTaskExecuter.java:35)
22-Mar-2017 19:47:27         at org.gradle.api.internal.tasks.execution.SkipUpToDateTaskExecuter.execute(SkipUpToDateTaskExecuter.java:64)
22-Mar-2017 19:47:27         at org.gradle.api.internal.tasks.execution.ValidatingTaskExecuter.execute(ValidatingTaskExecuter.java:58)
22-Mar-2017 19:47:27         at org.gradle.api.internal.tasks.execution.SkipEmptySourceFilesTaskExecuter.execute(SkipEmptySourceFilesTaskExecuter.java:42)
22-Mar-2017 19:47:27         at org.gradle.api.internal.tasks.execution.SkipTaskWithNoActionsExecuter.execute(SkipTaskWithNoActionsExecuter.java:52)
22-Mar-2017 19:47:27         at org.gradle.api.internal.tasks.execution.SkipOnlyIfTaskExecuter.execute(SkipOnlyIfTaskExecuter.java:53)
22-Mar-2017 19:47:27         at org.gradle.api.internal.tasks.execution.ExecuteAtMostOnceTaskExecuter.execute(ExecuteAtMostOnceTaskExecuter.java:43)
22-Mar-2017 19:47:27         at org.gradle.api.internal.AbstractTask.executeWithoutThrowingTaskFailure(AbstractTask.java:305)
22-Mar-2017 19:47:27         at org.gradle.execution.taskgraph.AbstractTaskPlanExecutor$TaskExecutorWorker.executeTask(AbstractTaskPlanExecutor.java:79)
22-Mar-2017 19:47:27         at org.gradle.execution.taskgraph.AbstractTaskPlanExecutor$TaskExecutorWorker.processTask(AbstractTaskPlanExecutor.java:63)
22-Mar-2017 19:47:27         at org.gradle.execution.taskgraph.AbstractTaskPlanExecutor$TaskExecutorWorker.run(AbstractTaskPlanExecutor.java:51)
22-Mar-2017 19:47:27         at org.gradle.execution.taskgraph.DefaultTaskPlanExecutor.process(DefaultTaskPlanExecutor.java:23)
22-Mar-2017 19:47:27         at org.gradle.execution.taskgraph.DefaultTaskGraphExecuter.execute(DefaultTaskGraphExecuter.java:88)
22-Mar-2017 19:47:27         at org.gradle.execution.SelectedTaskExecutionAction.execute(SelectedTaskExecutionAction.java:29)
22-Mar-2017 19:47:27         at org.gradle.execution.DefaultBuildExecuter.execute(DefaultBuildExecuter.java:62)
22-Mar-2017 19:47:27         at org.gradle.execution.DefaultBuildExecuter.access$200(DefaultBuildExecuter.java:23)
22-Mar-2017 19:47:27         at org.gradle.execution.DefaultBuildExecuter$2.proceed(DefaultBuildExecuter.java:68)
22-Mar-2017 19:47:27         at org.gradle.execution.DryRunBuildExecutionAction.execute(DryRunBuildExecutionAction.java:32)
22-Mar-2017 19:47:27         at org.gradle.execution.DefaultBuildExecuter.execute(DefaultBuildExecuter.java:62)
22-Mar-2017 19:47:27         at org.gradle.execution.DefaultBuildExecuter.execute(DefaultBuildExecuter.java:55)
22-Mar-2017 19:47:27         at org.gradle.initialization.DefaultGradleLauncher.doBuildStages(DefaultGradleLauncher.java:149)
22-Mar-2017 19:47:27         at org.gradle.initialization.DefaultGradleLauncher.doBuild(DefaultGradleLauncher.java:106)
22-Mar-2017 19:47:27         at org.gradle.initialization.DefaultGradleLauncher.run(DefaultGradleLauncher.java:86)
22-Mar-2017 19:47:27         at org.gradle.launcher.exec.InProcessBuildActionExecuter$DefaultBuildController.run(InProcessBuildActionExecuter.java:80)
22-Mar-2017 19:47:27         at org.gradle.launcher.cli.ExecuteBuildAction.run(ExecuteBuildAction.java:33)
22-Mar-2017 19:47:27         at org.gradle.launcher.cli.ExecuteBuildAction.run(ExecuteBuildAction.java:24)
22-Mar-2017 19:47:27         at org.gradle.launcher.exec.InProcessBuildActionExecuter.execute(InProcessBuildActionExecuter.java:36)
22-Mar-2017 19:47:27         at org.gradle.launcher.exec.InProcessBuildActionExecuter.execute(InProcessBuildActionExecuter.java:26)
22-Mar-2017 19:47:27         at org.gradle.launcher.cli.RunBuildAction.run(RunBuildAction.java:51)
22-Mar-2017 19:47:27         at org.gradle.internal.Actions$RunnableActionAdapter.execute(Actions.java:171)
22-Mar-2017 19:47:27         at org.gradle.launcher.cli.CommandLineActionFactory$ParseAndBuildAction.execute(CommandLineActionFactory.java:237)
22-Mar-2017 19:47:27         at org.gradle.launcher.cli.CommandLineActionFactory$ParseAndBuildAction.execute(CommandLineActionFactory.java:210)
22-Mar-2017 19:47:27         at org.gradle.launcher.cli.JavaRuntimeValidationAction.execute(JavaRuntimeValidationAction.java:35)
22-Mar-2017 19:47:27         at org.gradle.launcher.cli.JavaRuntimeValidationAction.execute(JavaRuntimeValidationAction.java:24)
22-Mar-2017 19:47:27         at org.gradle.launcher.cli.CommandLineActionFactory$WithLogging.execute(CommandLineActionFactory.java:206)
22-Mar-2017 19:47:27         at org.gradle.launcher.cli.CommandLineActionFactory$WithLogging.execute(CommandLineActionFactory.java:169)
22-Mar-2017 19:47:27         at org.gradle.launcher.cli.ExceptionReportingAction.execute(ExceptionReportingAction.java:33)
22-Mar-2017 19:47:27         at org.gradle.launcher.cli.ExceptionReportingAction.execute(ExceptionReportingAction.java:22)
22-Mar-2017 19:47:27         at org.gradle.launcher.Main.doAction(Main.java:33)
22-Mar-2017 19:47:27         at org.gradle.launcher.bootstrap.EntryPoint.run(EntryPoint.java:45)
22-Mar-2017 19:47:27         at sun.reflect.NativeMethodAccessorImpl.invoke0(Native Method)
22-Mar-2017 19:47:27         at sun.reflect.NativeMethodAccessorImpl.invoke(NativeMethodAccessorImpl.java:57)
22-Mar-2017 19:47:27         at sun.reflect.DelegatingMethodAccessorImpl.invoke(DelegatingMethodAccessorImpl.java:43)
22-Mar-2017 19:47:27         at java.lang.reflect.Method.invoke(Method.java:606)
22-Mar-2017 19:47:27         at org.gradle.launcher.bootstrap.ProcessBootstrap.runNoExit(ProcessBootstrap.java:54)
22-Mar-2017 19:47:27         at org.gradle.launcher.bootstrap.ProcessBootstrap.run(ProcessBootstrap.java:35)
22-Mar-2017 19:47:27         at org.gradle.launcher.GradleMain.main(GradleMain.java:23)
22-Mar-2017 19:47:27         at sun.reflect.NativeMethodAccessorImpl.invoke0(Native Method)
22-Mar-2017 19:47:27         at sun.reflect.NativeMethodAccessorImpl.invoke(NativeMethodAccessorImpl.java:57)
22-Mar-2017 19:47:27         at sun.reflect.DelegatingMethodAccessorImpl.invoke(DelegatingMethodAccessorImpl.java:43)
22-Mar-2017 19:47:27         at java.lang.reflect.Method.invoke(Method.java:606)
22-Mar-2017 19:47:27         at org.gradle.wrapper.BootstrapMainStarter.start(BootstrapMainStarter.java:30)
22-Mar-2017 19:47:27         at org.gradle.wrapper.WrapperExecutor.execute(WrapperExecutor.java:127)
22-Mar-2017 19:47:27         at org.gradle.wrapper.GradleWrapperMain.main(GradleWrapperMain.java:55)
22-Mar-2017 19:47:27 19:47:27.752 [DEBUG] [org.apache.http.impl.conn.DefaultClientConnection] Connection 0.0.0.0:40694<->35.186.232.213:443 closed
22-Mar-2017 19:47:27 19:47:27.752 [DEBUG] [org.gradle.api.internal.tasks.execution.ExecuteAtMostOnceTaskExecuter] Finished executing task ':artifactoryPublish'
22-Mar-2017 19:47:27 19:47:27.753 [LIFECYCLE] [class org.gradle.TaskExecutionLogger] :artifactoryPublish FAILED
22-Mar-2017 19:47:27 19:47:27.753 [INFO] [org.gradle.execution.taskgraph.AbstractTaskPlanExecutor] :artifactoryPublish (Thread[main,5,main]) completed. Took 1 mins 20.987 secs.
22-Mar-2017 19:47:27 19:47:27.754 [DEBUG] [org.gradle.execution.taskgraph.AbstractTaskPlanExecutor] Task worker [Thread[main,5,main]] finished, busy: 12 mins 54.528 secs, idle: 0.271 secs
22-Mar-2017 19:47:27 19:47:27.777 [ERROR] [org.gradle.BuildExceptionReporter]
22-Mar-2017 19:47:27 19:47:27.784 [ERROR] [org.gradle.BuildExceptionReporter] FAILURE: Build failed with an exception.
22-Mar-2017 19:47:27 19:47:27.784 [ERROR] [org.gradle.BuildExceptionReporter]
22-Mar-2017 19:47:27 19:47:27.784 [ERROR] [org.gradle.BuildExceptionReporter] * What went wrong:
22-Mar-2017 19:47:27 19:47:27.784 [ERROR] [org.gradle.BuildExceptionReporter] Execution failed for task ':artifactoryPublish'.
22-Mar-2017 19:47:27 19:47:27.785 [ERROR] [org.gradle.BuildExceptionReporter] > java.io.IOException: Failed to deploy file: HTTP response code: 401. HTTP response message: Unauthorized
22-Mar-2017 19:47:27 19:47:27.786 [ERROR] [org.gradle.BuildExceptionReporter]
22-Mar-2017 19:47:27 19:47:27.786 [ERROR] [org.gradle.BuildExceptionReporter] * Exception is:
22-Mar-2017 19:47:27 19:47:27.787 [ERROR] [org.gradle.BuildExceptionReporter] org.gradle.api.tasks.TaskExecutionException: Execution failed for task ':artifactoryPublish'.
22-Mar-2017 19:47:27 19:47:27.787 [ERROR] [org.gradle.BuildExceptionReporter]         at org.gradle.api.internal.tasks.execution.ExecuteActionsTaskExecuter.executeActions(ExecuteActionsTaskExecuter.java:69)
22-Mar-2017 19:47:27 19:47:27.788 [ERROR] [org.gradle.BuildExceptionReporter]         at org.gradle.api.internal.tasks.execution.ExecuteActionsTaskExecuter.execute(ExecuteActionsTaskExecuter.java:46)
22-Mar-2017 19:47:27 19:47:27.788 [ERROR] [org.gradle.BuildExceptionReporter]         at org.gradle.api.internal.tasks.execution.PostExecutionAnalysisTaskExecuter.execute(PostExecutionAnalysisTaskExecuter.java:35)
22-Mar-2017 19:47:27 19:47:27.788 [ERROR] [org.gradle.BuildExceptionReporter]         at org.gradle.api.internal.tasks.execution.SkipUpToDateTaskExecuter.execute(SkipUpToDateTaskExecuter.java:64)
22-Mar-2017 19:47:27 19:47:27.789 [ERROR] [org.gradle.BuildExceptionReporter]         at org.gradle.api.internal.tasks.execution.ValidatingTaskExecuter.execute(ValidatingTaskExecuter.java:58)
22-Mar-2017 19:47:27 19:47:27.789 [ERROR] [org.gradle.BuildExceptionReporter]         at org.gradle.api.internal.tasks.execution.SkipEmptySourceFilesTaskExecuter.execute(SkipEmptySourceFilesTaskExecuter.java:42)
22-Mar-2017 19:47:27 19:47:27.789 [ERROR] [org.gradle.BuildExceptionReporter]         at org.gradle.api.internal.tasks.execution.SkipTaskWithNoActionsExecuter.execute(SkipTaskWithNoActionsExecuter.java:52)
22-Mar-2017 19:47:27 19:47:27.790 [ERROR] [org.gradle.BuildExceptionReporter]         at org.gradle.api.internal.tasks.execution.SkipOnlyIfTaskExecuter.execute(SkipOnlyIfTaskExecuter.java:53)
22-Mar-2017 19:47:27 19:47:27.790 [ERROR] [org.gradle.BuildExceptionReporter]         at org.gradle.api.internal.tasks.execution.ExecuteAtMostOnceTaskExecuter.execute(ExecuteAtMostOnceTaskExecuter.java:43)
22-Mar-2017 19:47:27 19:47:27.790 [ERROR] [org.gradle.BuildExceptionReporter]         at org.gradle.api.internal.AbstractTask.executeWithoutThrowingTaskFailure(AbstractTask.java:305)
22-Mar-2017 19:47:27 19:47:27.791 [ERROR] [org.gradle.BuildExceptionReporter]         at org.gradle.execution.taskgraph.AbstractTaskPlanExecutor$TaskExecutorWorker.executeTask(AbstractTaskPlanExecutor.java:79)
22-Mar-2017 19:47:27 19:47:27.791 [ERROR] [org.gradle.BuildExceptionReporter]         at org.gradle.execution.taskgraph.AbstractTaskPlanExecutor$TaskExecutorWorker.processTask(AbstractTaskPlanExecutor.java:63)
22-Mar-2017 19:47:27 19:47:27.791 [ERROR] [org.gradle.BuildExceptionReporter]         at org.gradle.execution.taskgraph.AbstractTaskPlanExecutor$TaskExecutorWorker.run(AbstractTaskPlanExecutor.java:51)
22-Mar-2017 19:47:27 19:47:27.792 [ERROR] [org.gradle.BuildExceptionReporter]         at org.gradle.execution.taskgraph.DefaultTaskPlanExecutor.process(DefaultTaskPlanExecutor.java:23)
22-Mar-2017 19:47:27 19:47:27.792 [ERROR] [org.gradle.BuildExceptionReporter]         at org.gradle.execution.taskgraph.DefaultTaskGraphExecuter.execute(DefaultTaskGraphExecuter.java:88)
22-Mar-2017 19:47:27 19:47:27.792 [ERROR] [org.gradle.BuildExceptionReporter]         at org.gradle.execution.SelectedTaskExecutionAction.execute(SelectedTaskExecutionAction.java:29)
22-Mar-2017 19:47:27 19:47:27.793 [ERROR] [org.gradle.BuildExceptionReporter]         at org.gradle.execution.DefaultBuildExecuter.execute(DefaultBuildExecuter.java:62)
22-Mar-2017 19:47:27 19:47:27.793 [ERROR] [org.gradle.BuildExceptionReporter]         at org.gradle.execution.DefaultBuildExecuter.access$200(DefaultBuildExecuter.java:23)
22-Mar-2017 19:47:27 19:47:27.793 [ERROR] [org.gradle.BuildExceptionReporter]         at org.gradle.execution.DefaultBuildExecuter$2.proceed(DefaultBuildExecuter.java:68)
22-Mar-2017 19:47:27 19:47:27.794 [ERROR] [org.gradle.BuildExceptionReporter]         at org.gradle.execution.DryRunBuildExecutionAction.execute(DryRunBuildExecutionAction.java:32)
22-Mar-2017 19:47:27 19:47:27.794 [ERROR] [org.gradle.BuildExceptionReporter]         at org.gradle.execution.DefaultBuildExecuter.execute(DefaultBuildExecuter.java:62)
22-Mar-2017 19:47:27 19:47:27.794 [ERROR] [org.gradle.BuildExceptionReporter]         at org.gradle.execution.DefaultBuildExecuter.execute(DefaultBuildExecuter.java:55)
22-Mar-2017 19:47:27 19:47:27.795 [ERROR] [org.gradle.BuildExceptionReporter]         at org.gradle.initialization.DefaultGradleLauncher.doBuildStages(DefaultGradleLauncher.java:149)
22-Mar-2017 19:47:27 19:47:27.795 [ERROR] [org.gradle.BuildExceptionReporter]         at org.gradle.initialization.DefaultGradleLauncher.doBuild(DefaultGradleLauncher.java:106)
22-Mar-2017 19:47:27 19:47:27.795 [ERROR] [org.gradle.BuildExceptionReporter]         at org.gradle.initialization.DefaultGradleLauncher.run(DefaultGradleLauncher.java:86)
22-Mar-2017 19:47:27 19:47:27.796 [ERROR] [org.gradle.BuildExceptionReporter]         at org.gradle.launcher.exec.InProcessBuildActionExecuter$DefaultBuildController.run(InProcessBuildActionExecuter.java:80)
22-Mar-2017 19:47:27 19:47:27.796 [ERROR] [org.gradle.BuildExceptionReporter]         at org.gradle.launcher.cli.ExecuteBuildAction.run(ExecuteBuildAction.java:33)
22-Mar-2017 19:47:27 19:47:27.796 [ERROR] [org.gradle.BuildExceptionReporter]         at org.gradle.launcher.cli.ExecuteBuildAction.run(ExecuteBuildAction.java:24)
22-Mar-2017 19:47:27 19:47:27.797 [ERROR] [org.gradle.BuildExceptionReporter]         at org.gradle.launcher.exec.InProcessBuildActionExecuter.execute(InProcessBuildActionExecuter.java:36)
22-Mar-2017 19:47:27 19:47:27.797 [ERROR] [org.gradle.BuildExceptionReporter]         at org.gradle.launcher.exec.InProcessBuildActionExecuter.execute(InProcessBuildActionExecuter.java:26)
22-Mar-2017 19:47:27 19:47:27.797 [ERROR] [org.gradle.BuildExceptionReporter]         at org.gradle.launcher.cli.RunBuildAction.run(RunBuildAction.java:51)
22-Mar-2017 19:47:27 19:47:27.798 [ERROR] [org.gradle.BuildExceptionReporter]         at org.gradle.internal.Actions$RunnableActionAdapter.execute(Actions.java:171)
22-Mar-2017 19:47:27 19:47:27.798 [ERROR] [org.gradle.BuildExceptionReporter]         at org.gradle.launcher.cli.CommandLineActionFactory$ParseAndBuildAction.execute(CommandLineActionFactory.java:237)
22-Mar-2017 19:47:27 19:47:27.798 [ERROR] [org.gradle.BuildExceptionReporter]         at org.gradle.launcher.cli.CommandLineActionFactory$ParseAndBuildAction.execute(CommandLineActionFactory.java:210)
22-Mar-2017 19:47:27 19:47:27.799 [ERROR] [org.gradle.BuildExceptionReporter]         at org.gradle.launcher.cli.JavaRuntimeValidationAction.execute(JavaRuntimeValidationAction.java:35)
22-Mar-2017 19:47:27 19:47:27.799 [ERROR] [org.gradle.BuildExceptionReporter]         at org.gradle.launcher.cli.JavaRuntimeValidationAction.execute(JavaRuntimeValidationAction.java:24)
22-Mar-2017 19:47:27 19:47:27.799 [ERROR] [org.gradle.BuildExceptionReporter]         at org.gradle.launcher.cli.CommandLineActionFactory$WithLogging.execute(CommandLineActionFactory.java:206)
22-Mar-2017 19:47:27 19:47:27.800 [ERROR] [org.gradle.BuildExceptionReporter]         at org.gradle.launcher.cli.CommandLineActionFactory$WithLogging.execute(CommandLineActionFactory.java:169)
22-Mar-2017 19:47:27 19:47:27.800 [ERROR] [org.gradle.BuildExceptionReporter]         at org.gradle.launcher.cli.ExceptionReportingAction.execute(ExceptionReportingAction.java:33)
22-Mar-2017 19:47:27 19:47:27.800 [ERROR] [org.gradle.BuildExceptionReporter]         at org.gradle.launcher.cli.ExceptionReportingAction.execute(ExceptionReportingAction.java:22)
22-Mar-2017 19:47:27 19:47:27.801 [ERROR] [org.gradle.BuildExceptionReporter]         at org.gradle.launcher.Main.doAction(Main.java:33)
22-Mar-2017 19:47:27 19:47:27.801 [ERROR] [org.gradle.BuildExceptionReporter]         at org.gradle.launcher.bootstrap.EntryPoint.run(EntryPoint.java:45)
22-Mar-2017 19:47:27 19:47:27.801 [ERROR] [org.gradle.BuildExceptionReporter]         at org.gradle.launcher.bootstrap.ProcessBootstrap.runNoExit(ProcessBootstrap.java:54)
22-Mar-2017 19:47:27 19:47:27.802 [ERROR] [org.gradle.BuildExceptionReporter]         at org.gradle.launcher.bootstrap.ProcessBootstrap.run(ProcessBootstrap.java:35)
22-Mar-2017 19:47:27 19:47:27.802 [ERROR] [org.gradle.BuildExceptionReporter]         at org.gradle.launcher.GradleMain.main(GradleMain.java:23)
22-Mar-2017 19:47:27 19:47:27.802 [ERROR] [org.gradle.BuildExceptionReporter]         at org.gradle.wrapper.BootstrapMainStarter.start(BootstrapMainStarter.java:30)
22-Mar-2017 19:47:27 19:47:27.803 [ERROR] [org.gradle.BuildExceptionReporter]         at org.gradle.wrapper.WrapperExecutor.execute(WrapperExecutor.java:127)
22-Mar-2017 19:47:27 19:47:27.803 [ERROR] [org.gradle.BuildExceptionReporter]         at org.gradle.wrapper.GradleWrapperMain.main(GradleWrapperMain.java:55)
22-Mar-2017 19:47:27 19:47:27.803 [ERROR] [org.gradle.BuildExceptionReporter] Caused by: org.gradle.internal.UncheckedException: java.io.IOException: Failed to deploy file: HTTP response code: 401. HTTP response message: Unauthorized
22-Mar-2017 19:47:27 19:47:27.804 [ERROR] [org.gradle.BuildExceptionReporter]         at org.gradle.internal.UncheckedException.throwAsUncheckedException(UncheckedException.java:39)
22-Mar-2017 19:47:27 19:47:27.804 [ERROR] [org.gradle.BuildExceptionReporter]         at org.gradle.internal.reflect.JavaMethod.invoke(JavaMethod.java:66)
22-Mar-2017 19:47:27 19:47:27.804 [ERROR] [org.gradle.BuildExceptionReporter]         at org.gradle.api.internal.project.taskfactory.AnnotationProcessingTaskFactory$StandardTaskAction.doExecute(AnnotationProcessingTaskFactory.java:218)
22-Mar-2017 19:47:27 19:47:27.805 [ERROR] [org.gradle.BuildExceptionReporter]         at org.gradle.api.internal.project.taskfactory.AnnotationProcessingTaskFactory$StandardTaskAction.execute(AnnotationProcessingTaskFactory.java:211)
22-Mar-2017 19:47:27 19:47:27.805 [ERROR] [org.gradle.BuildExceptionReporter]         at org.gradle.api.internal.project.taskfactory.AnnotationProcessingTaskFactory$StandardTaskAction.execute(AnnotationProcessingTaskFactory.java:200)
22-Mar-2017 19:47:27 19:47:27.806 [ERROR] [org.gradle.BuildExceptionReporter]         at org.gradle.api.internal.AbstractTask$TaskActionWrapper.execute(AbstractTask.java:579)
22-Mar-2017 19:47:27 19:47:27.806 [ERROR] [org.gradle.BuildExceptionReporter]         at org.gradle.api.internal.AbstractTask$TaskActionWrapper.execute(AbstractTask.java:562)
22-Mar-2017 19:47:27 19:47:27.806 [ERROR] [org.gradle.BuildExceptionReporter]         at org.gradle.api.internal.tasks.execution.ExecuteActionsTaskExecuter.executeAction(ExecuteActionsTaskExecuter.java:80)
22-Mar-2017 19:47:27 19:47:27.807 [ERROR] [org.gradle.BuildExceptionReporter]         at org.gradle.api.internal.tasks.execution.ExecuteActionsTaskExecuter.executeActions(ExecuteActionsTaskExecuter.java:61)
22-Mar-2017 19:47:27 19:47:27.807 [ERROR] [org.gradle.BuildExceptionReporter]         ... 47 more
22-Mar-2017 19:47:27 19:47:27.807 [ERROR] [org.gradle.BuildExceptionReporter] Caused by: java.io.IOException: Failed to deploy file: HTTP response code: 401. HTTP response message: Unauthorized
22-Mar-2017 19:47:27 19:47:27.808 [ERROR] [org.gradle.BuildExceptionReporter]         at org.jfrog.build.extractor.clientConfiguration.client.ArtifactoryBuildInfoClient.throwHttpIOException(ArtifactoryBuildInfoClient.java:744)
22-Mar-2017 19:47:27 19:47:27.808 [ERROR] [org.gradle.BuildExceptionReporter]         at org.jfrog.build.extractor.clientConfiguration.client.ArtifactoryBuildInfoClient.uploadFile(ArtifactoryBuildInfoClient.java:624)
22-Mar-2017 19:47:27 19:47:27.808 [ERROR] [org.gradle.BuildExceptionReporter]         at org.jfrog.build.extractor.clientConfiguration.client.ArtifactoryBuildInfoClient.deployArtifact(ArtifactoryBuildInfoClient.java:330)
22-Mar-2017 19:47:27 19:47:27.809 [ERROR] [org.gradle.BuildExceptionReporter]         at org.jfrog.gradle.plugin.artifactory.task.BuildInfoBaseTask.deployArtifacts(BuildInfoBaseTask.java:409)
22-Mar-2017 19:47:27 19:47:27.809 [ERROR] [org.gradle.BuildExceptionReporter]         at org.jfrog.gradle.plugin.artifactory.task.BuildInfoBaseTask.prepareAndDeploy(BuildInfoBaseTask.java:284)
22-Mar-2017 19:47:27 19:47:27.809 [ERROR] [org.gradle.BuildExceptionReporter]         at org.jfrog.gradle.plugin.artifactory.task.BuildInfoBaseTask.collectProjectBuildInfo(BuildInfoBaseTask.java:363)
22-Mar-2017 19:47:27 19:47:27.810 [ERROR] [org.gradle.BuildExceptionReporter]         at org.gradle.internal.reflect.JavaMethod.invoke(JavaMethod.java:63)
22-Mar-2017 19:47:27 19:47:27.810 [ERROR] [org.gradle.BuildExceptionReporter]         ... 54 more
22-Mar-2017 19:47:27 19:47:27.810 [ERROR] [org.gradle.BuildExceptionReporter]
22-Mar-2017 19:47:27 19:47:27.811 [LIFECYCLE] [org.gradle.BuildResultLogger]
22-Mar-2017 19:47:27 19:47:27.811 [LIFECYCLE] [org.gradle.BuildResultLogger] BUILD FAILED
22-Mar-2017 19:47:27 19:47:27.811 [LIFECYCLE] [org.gradle.BuildResultLogger]
22-Mar-2017 19:47:27 19:47:27.811 [LIFECYCLE] [org.gradle.BuildResultLogger] Total time: 14 mins 2.094 secs
22-Mar-2017 19:47:27 19:47:27.812 [DEBUG] [org.gradle.api.internal.tasks.compile.daemon.CompilerDaemonManager] Stopping 4 compiler daemon(s).
22-Mar-2017 19:47:27 19:47:27.815 [QUIET] [system.out] 19:47:27.815 [DEBUG] [org.gradle.process.internal.child.ActionExecutionWorker] Completed Gradle Compiler Daemon 1.
22-Mar-2017 19:47:27 19:47:27.821 [QUIET] [system.out] 19:47:27.821 [DEBUG] [org.gradle.process.internal.child.ActionExecutionWorker] Stopping client connection.
22-Mar-2017 19:47:27 19:47:27.831 [DEBUG] [org.gradle.process.internal.DefaultExecHandle] Changing state to: SUCCEEDED
22-Mar-2017 19:47:27 19:47:27.832 [DEBUG] [org.gradle.process.internal.DefaultExecHandle] Process 'Gradle Compiler Daemon 1' finished with exit value 0 (state: SUCCEEDED)
22-Mar-2017 19:47:27 19:47:27.836 [QUIET] [system.out] 19:47:27.835 [DEBUG] [org.gradle.process.internal.child.ActionExecutionWorker] Completed Gradle Compiler Daemon 2.
22-Mar-2017 19:47:27 19:47:27.841 [QUIET] [system.out] 19:47:27.841 [DEBUG] [org.gradle.process.internal.child.ActionExecutionWorker] Stopping client connection.
22-Mar-2017 19:47:27 19:47:27.865 [DEBUG] [org.gradle.process.internal.DefaultExecHandle] Changing state to: SUCCEEDED
22-Mar-2017 19:47:27 19:47:27.866 [DEBUG] [org.gradle.process.internal.DefaultExecHandle] Process 'Gradle Compiler Daemon 2' finished with exit value 0 (state: SUCCEEDED)
22-Mar-2017 19:47:27 19:47:27.870 [QUIET] [system.out] 19:47:27.870 [DEBUG] [org.gradle.process.internal.child.ActionExecutionWorker] Completed Gradle Compiler Daemon 3.
22-Mar-2017 19:47:27 19:47:27.876 [QUIET] [system.out] 19:47:27.876 [DEBUG] [org.gradle.process.internal.child.ActionExecutionWorker] Stopping client connection.
22-Mar-2017 19:47:27 19:47:27.886 [DEBUG] [org.gradle.process.internal.DefaultExecHandle] Changing state to: SUCCEEDED
22-Mar-2017 19:47:27 19:47:27.886 [DEBUG] [org.gradle.process.internal.DefaultExecHandle] Process 'Gradle Compiler Daemon 3' finished with exit value 0 (state: SUCCEEDED)
22-Mar-2017 19:47:27 19:47:27.890 [QUIET] [system.out] 19:47:27.889 [DEBUG] [org.gradle.process.internal.child.ActionExecutionWorker] Completed Gradle Compiler Daemon 4.
22-Mar-2017 19:47:27 19:47:27.900 [QUIET] [system.out] 19:47:27.899 [DEBUG] [org.gradle.process.internal.child.ActionExecutionWorker] Stopping client connection.
22-Mar-2017 19:47:27 19:47:27.907 [DEBUG] [org.gradle.process.internal.DefaultExecHandle] Changing state to: SUCCEEDED
22-Mar-2017 19:47:27 19:47:27.907 [DEBUG] [org.gradle.process.internal.DefaultExecHandle] Process 'Gradle Compiler Daemon 4' finished with exit value 0 (state: SUCCEEDED)
22-Mar-2017 19:47:27 19:47:27.908 [INFO] [org.gradle.api.internal.tasks.compile.daemon.CompilerDaemonManager] Stopped 4 compiler daemon(s).
22-Mar-2017 19:47:27 19:47:27.908 [DEBUG] [org.gradle.cache.internal.DefaultFileLockManager] Releasing lock on buildscript class cache for settings file '/opt/bamboo-home/xml-data/build-dir/XD-PUB2-JOB1/settings.gradle' (/opt/users/bamboo/.gradle/caches/2.2/scripts/settings_1n9fdhmofdta6n70sagq903q5/SettingsScript/buildscript).
22-Mar-2017 19:47:27 19:47:27.909 [DEBUG] [org.gradle.cache.internal.DefaultFileLockManager] Releasing lock on no_buildscript class cache for settings file '/opt/bamboo-home/xml-data/build-dir/XD-PUB2-JOB1/settings.gradle' (/opt/users/bamboo/.gradle/caches/2.2/scripts/settings_1n9fdhmofdta6n70sagq903q5/SettingsScript/no_buildscript).
22-Mar-2017 19:47:27 19:47:27.909 [DEBUG] [org.gradle.cache.internal.DefaultFileLockManager] Releasing lock on buildscript class cache for build file '/opt/bamboo-home/xml-data/build-dir/XD-PUB2-JOB1/build.gradle' (/opt/users/bamboo/.gradle/caches/2.2/scripts/build_2jncf0ip5cg6pdtehvqy8aaco/ProjectScript/buildscript).
22-Mar-2017 19:47:27 19:47:27.909 [DEBUG] [org.gradle.cache.internal.DefaultFileLockManager] Releasing lock on no_buildscript class cache for build file '/opt/bamboo-home/xml-data/build-dir/XD-PUB2-JOB1/build.gradle' (/opt/users/bamboo/.gradle/caches/2.2/scripts/build_2jncf0ip5cg6pdtehvqy8aaco/ProjectScript/no_buildscript).
22-Mar-2017 19:47:27 19:47:27.909 [DEBUG] [org.gradle.cache.internal.DefaultFileLockManager] Releasing lock on buildscript class cache for script '/opt/bamboo-home/xml-data/build-dir/XD-PUB2-JOB1/gradle/build-common.gradle' (/opt/users/bamboo/.gradle/caches/2.2/scripts/build_common_37lh2tyzewy5ilo8yajyqx72j/DefaultScript/buildscript).
22-Mar-2017 19:47:27 19:47:27.909 [DEBUG] [org.gradle.cache.internal.DefaultFileLockManager] Releasing lock on no_buildscript class cache for script '/opt/bamboo-home/xml-data/build-dir/XD-PUB2-JOB1/gradle/build-common.gradle' (/opt/users/bamboo/.gradle/caches/2.2/scripts/build_common_37lh2tyzewy5ilo8yajyqx72j/DefaultScript/no_buildscript).
22-Mar-2017 19:47:27 19:47:27.909 [DEBUG] [org.gradle.cache.internal.DefaultFileLockManager] Releasing lock on buildscript class cache for script '/opt/bamboo-home/xml-data/build-dir/XD-PUB2-JOB1/publish-maven.gradle' (/opt/users/bamboo/.gradle/caches/2.2/scripts/publish_maven_8qpbh5yz7msxyn1a1u7h3zjhi/DefaultScript/buildscript).
22-Mar-2017 19:47:27 19:47:27.909 [DEBUG] [org.gradle.cache.internal.DefaultFileLockManager] Releasing lock on no_buildscript class cache for script '/opt/bamboo-home/xml-data/build-dir/XD-PUB2-JOB1/publish-maven.gradle' (/opt/users/bamboo/.gradle/caches/2.2/scripts/publish_maven_8qpbh5yz7msxyn1a1u7h3zjhi/DefaultScript/no_buildscript).
22-Mar-2017 19:47:27 19:47:27.910 [DEBUG] [org.gradle.cache.internal.DefaultFileLockManager] Releasing lock on buildscript class cache for script '/opt/bamboo-home/xml-data/build-dir/XD-PUB2-JOB1/gradle/build-modules.gradle' (/opt/users/bamboo/.gradle/caches/2.2/scripts/build_modules_d6njiogmx48fq2qpeh9rvczxy/DefaultScript/buildscript).
22-Mar-2017 19:47:27 19:47:27.910 [DEBUG] [org.gradle.cache.internal.DefaultFileLockManager] Releasing lock on no_buildscript class cache for script '/opt/bamboo-home/xml-data/build-dir/XD-PUB2-JOB1/gradle/build-modules.gradle' (/opt/users/bamboo/.gradle/caches/2.2/scripts/build_modules_d6njiogmx48fq2qpeh9rvczxy/DefaultScript/no_buildscript).
22-Mar-2017 19:47:27 19:47:27.910 [DEBUG] [org.gradle.cache.internal.DefaultFileLockManager] Releasing lock on buildscript class cache for script '/opt/bamboo-home/xml-data/build-dir/XD-PUB2-JOB1/gradle/build-extensions.gradle' (/opt/users/bamboo/.gradle/caches/2.2/scripts/build_extensions_bctqq2iwtw99679pgwapzeu0d/DefaultScript/buildscript).
22-Mar-2017 19:47:27 19:47:27.910 [DEBUG] [org.gradle.cache.internal.DefaultFileLockManager] Releasing lock on no_buildscript class cache for script '/opt/bamboo-home/xml-data/build-dir/XD-PUB2-JOB1/gradle/build-extensions.gradle' (/opt/users/bamboo/.gradle/caches/2.2/scripts/build_extensions_bctqq2iwtw99679pgwapzeu0d/DefaultScript/no_buildscript).
22-Mar-2017 19:47:27 19:47:27.910 [DEBUG] [org.gradle.cache.internal.DefaultFileLockManager] Releasing lock on buildscript class cache for script '/opt/bamboo-home/xml-data/build-dir/XD-PUB2-JOB1/gradle/build-messagebuses.gradle' (/opt/users/bamboo/.gradle/caches/2.2/scripts/build_messagebuses_amv3z1wmwlcjtijny2wmruzku/DefaultScript/buildscript).
22-Mar-2017 19:47:27 19:47:27.910 [DEBUG] [org.gradle.cache.internal.DefaultFileLockManager] Releasing lock on no_buildscript class cache for script '/opt/bamboo-home/xml-data/build-dir/XD-PUB2-JOB1/gradle/build-messagebuses.gradle' (/opt/users/bamboo/.gradle/caches/2.2/scripts/build_messagebuses_amv3z1wmwlcjtijny2wmruzku/DefaultScript/no_buildscript).
22-Mar-2017 19:47:27 19:47:27.911 [DEBUG] [org.gradle.cache.internal.DefaultFileLockManager] Releasing lock on buildscript class cache for script '/opt/bamboo-home/xml-data/build-dir/XD-PUB2-JOB1/gradle/build-starters.gradle' (/opt/users/bamboo/.gradle/caches/2.2/scripts/build_starters_7c27humdjypz5m97ui01e879w/DefaultScript/buildscript).
22-Mar-2017 19:47:27 19:47:27.911 [DEBUG] [org.gradle.cache.internal.DefaultFileLockManager] Releasing lock on no_buildscript class cache for script '/opt/bamboo-home/xml-data/build-dir/XD-PUB2-JOB1/gradle/build-starters.gradle' (/opt/users/bamboo/.gradle/caches/2.2/scripts/build_starters_7c27humdjypz5m97ui01e879w/DefaultScript/no_buildscript).
22-Mar-2017 19:47:27 19:47:27.911 [DEBUG] [org.gradle.cache.internal.DefaultFileLockManager] Releasing lock on buildscript class cache for script '/opt/bamboo-home/xml-data/build-dir/XD-PUB2-JOB1/spring-xd-starters/spring-xd-module-parent/publish-maven.gradle' (/opt/users/bamboo/.gradle/caches/2.2/scripts/publish_maven_4w8djmqj3embvy9x5qsgonxp5/DefaultScript/buildscript).
22-Mar-2017 19:47:27 19:47:27.911 [DEBUG] [org.gradle.cache.internal.DefaultFileLockManager] Releasing lock on no_buildscript class cache for script '/opt/bamboo-home/xml-data/build-dir/XD-PUB2-JOB1/spring-xd-starters/spring-xd-module-parent/publish-maven.gradle' (/opt/users/bamboo/.gradle/caches/2.2/scripts/publish_maven_4w8djmqj3embvy9x5qsgonxp5/DefaultScript/no_buildscript).
22-Mar-2017 19:47:27 19:47:27.911 [DEBUG] [org.gradle.cache.internal.DefaultFileLockManager] Releasing lock on buildscript class cache for script '/opt/bamboo-home/xml-data/build-dir/XD-PUB2-JOB1/gradle/build-gradle-plugins.gradle' (/opt/users/bamboo/.gradle/caches/2.2/scripts/build_gradle_plugins_athxc1vsmg3cymgxviprt1tac/DefaultScript/buildscript).
22-Mar-2017 19:47:27 19:47:27.911 [DEBUG] [org.gradle.cache.internal.DefaultFileLockManager] Releasing lock on no_buildscript class cache for script '/opt/bamboo-home/xml-data/build-dir/XD-PUB2-JOB1/gradle/build-gradle-plugins.gradle' (/opt/users/bamboo/.gradle/caches/2.2/scripts/build_gradle_plugins_athxc1vsmg3cymgxviprt1tac/DefaultScript/no_buildscript).
22-Mar-2017 19:47:27 19:47:27.911 [DEBUG] [org.gradle.cache.internal.DefaultFileLockManager] Releasing lock on buildscript class cache for script '/opt/bamboo-home/xml-data/build-dir/XD-PUB2-JOB1/gradle/build-hadoop-distros.gradle' (/opt/users/bamboo/.gradle/caches/2.2/scripts/build_hadoop_distros_8ess79nrb3uf662goudzgezb/DefaultScript/buildscript).
22-Mar-2017 19:47:27 19:47:27.912 [DEBUG] [org.gradle.cache.internal.DefaultFileLockManager] Releasing lock on no_buildscript class cache for script '/opt/bamboo-home/xml-data/build-dir/XD-PUB2-JOB1/gradle/build-hadoop-distros.gradle' (/opt/users/bamboo/.gradle/caches/2.2/scripts/build_hadoop_distros_8ess79nrb3uf662goudzgezb/DefaultScript/no_buildscript).
22-Mar-2017 19:47:27 19:47:27.912 [DEBUG] [org.gradle.cache.internal.DefaultFileLockManager] Releasing lock on buildscript class cache for script '/opt/bamboo-home/xml-data/build-dir/XD-PUB2-JOB1/gradle/build-docs.gradle' (/opt/users/bamboo/.gradle/caches/2.2/scripts/build_docs_enidc7szfvuxj5yka3d9r6w60/DefaultScript/buildscript).
22-Mar-2017 19:47:27 19:47:27.912 [DEBUG] [org.gradle.cache.internal.DefaultFileLockManager] Releasing lock on no_buildscript class cache for script '/opt/bamboo-home/xml-data/build-dir/XD-PUB2-JOB1/gradle/build-docs.gradle' (/opt/users/bamboo/.gradle/caches/2.2/scripts/build_docs_enidc7szfvuxj5yka3d9r6w60/DefaultScript/no_buildscript).
22-Mar-2017 19:47:27 19:47:27.912 [DEBUG] [org.gradle.cache.internal.DefaultFileLockManager] Releasing lock on buildscript class cache for script '/opt/bamboo-home/xml-data/build-dir/XD-PUB2-JOB1/gradle/build-dist.gradle' (/opt/users/bamboo/.gradle/caches/2.2/scripts/build_dist_93ende1builpnwe3w1zujfc9e/DefaultScript/buildscript).
22-Mar-2017 19:47:27 19:47:27.912 [DEBUG] [org.gradle.cache.internal.DefaultFileLockManager] Releasing lock on no_buildscript class cache for script '/opt/bamboo-home/xml-data/build-dir/XD-PUB2-JOB1/gradle/build-dist.gradle' (/opt/users/bamboo/.gradle/caches/2.2/scripts/build_dist_93ende1builpnwe3w1zujfc9e/DefaultScript/no_buildscript).
22-Mar-2017 19:47:27 19:47:27.913 [DEBUG] [org.gradle.cache.internal.btree.BTreePersistentIndexedCache] Closing cache module-artifacts.bin (/opt/users/bamboo/.gradle/caches/modules-2/metadata-2.14/module-artifacts.bin)
22-Mar-2017 19:47:27 19:47:27.914 [DEBUG] [org.gradle.cache.internal.btree.BTreePersistentIndexedCache] Closing cache artifact-at-url.bin (/opt/users/bamboo/.gradle/caches/modules-2/metadata-2.14/artifact-at-url.bin)
22-Mar-2017 19:47:27 19:47:27.914 [DEBUG] [org.gradle.cache.internal.btree.BTreePersistentIndexedCache] Closing cache module-metadata.bin (/opt/users/bamboo/.gradle/caches/modules-2/metadata-2.14/module-metadata.bin)
22-Mar-2017 19:47:27 19:47:27.914 [DEBUG] [org.gradle.cache.internal.btree.BTreePersistentIndexedCache] Closing cache artifact-at-repository.bin (/opt/users/bamboo/.gradle/caches/modules-2/metadata-2.14/artifact-at-repository.bin)
22-Mar-2017 19:47:27 19:47:27.915 [DEBUG] [org.gradle.cache.internal.DefaultFileLockManager] Releasing lock on artifact cache (/opt/users/bamboo/.gradle/caches/modules-2).
22-Mar-2017 19:47:27 19:47:27.915 [DEBUG] [org.gradle.cache.internal.DefaultCacheAccess] Cache Plugin Resolution Cache (/opt/users/bamboo/.gradle/caches/2.2/plugin-resolution) was closed 0 times.
22-Mar-2017 19:47:27 19:47:27.950 [DEBUG] [org.gradle.cache.internal.btree.BTreePersistentIndexedCache] Closing cache fileHashes.bin (/opt/bamboo-home/xml-data/build-dir/XD-PUB2-JOB1/.gradle/2.2/taskArtifacts/fileHashes.bin)
22-Mar-2017 19:47:27 19:47:27.950 [DEBUG] [org.gradle.cache.internal.btree.BTreePersistentIndexedCache] Closing cache outputFileStates.bin (/opt/bamboo-home/xml-data/build-dir/XD-PUB2-JOB1/.gradle/2.2/taskArtifacts/outputFileStates.bin)
22-Mar-2017 19:47:27 19:47:27.950 [DEBUG] [org.gradle.cache.internal.btree.BTreePersistentIndexedCache] Closing cache taskArtifacts.bin (/opt/bamboo-home/xml-data/build-dir/XD-PUB2-JOB1/.gradle/2.2/taskArtifacts/taskArtifacts.bin)
22-Mar-2017 19:47:27 19:47:27.951 [DEBUG] [org.gradle.cache.internal.btree.BTreePersistentIndexedCache] Closing cache fileSnapshots.bin (/opt/bamboo-home/xml-data/build-dir/XD-PUB2-JOB1/.gradle/2.2/taskArtifacts/fileSnapshots.bin)
22-Mar-2017 19:47:27 19:47:27.951 [DEBUG] [org.gradle.cache.internal.DefaultFileLockManager] Releasing lock on task history cache (/opt/bamboo-home/xml-data/build-dir/XD-PUB2-JOB1/.gradle/2.2/taskArtifacts).
22-Mar-2017 19:47:27 19:47:27.952 [DEBUG] [org.gradle.api.internal.artifacts.ivyservice.ivyresolve.memcache.InMemoryCachedRepositoryFactory] In-memory dependency metadata cache closed. Repos cached: 2290, cache instances: 9, modules served from cache: 13764, artifacts: 7465
22-Mar-2017 19:47:27 19:47:27.954 [DEBUG] [org.gradle.api.internal.artifacts.ivyservice.resolveengine.store.CachedStoreFactory] Resolution result cache closed. Cache reads: 0, disk reads: 0 (avg: 0.0 secs, total: 0.0 secs)
22-Mar-2017 19:47:27 19:47:27.963 [DEBUG] [org.gradle.api.internal.artifacts.ivyservice.resolveengine.store.CachedStoreFactory] Resolved configuration cache closed. Cache reads: 0, disk reads: 160 (avg: 0.009 secs, total: 1.568 secs)
22-Mar-2017 19:47:27 19:47:27.964 [DEBUG] [org.gradle.api.internal.artifacts.ivyservice.resolveengine.store.ResolutionResultsStoreFactory] Deleted 2 resolution results binary files in 0.011 secs
22-Mar-2017 19:47:28
22-Mar-2017 19:47:28 Failing task since return code of [./gradlew --refresh-dependencies --stacktrace --debug clean build -x test dist -DbuildInfoConfig.propertiesFile=/tmp/buildinfo4644510273987378575properties artifactoryPublish] was 1 while expected 0
22-Mar-2017 19:47:28 Finished task 'build xd' with result: Failed
22-Mar-2017 19:47:28 Running post build plugin 'Docker Container Cleanup'
22-Mar-2017 19:47:29 Running post build plugin 'NCover Results Collector'
22-Mar-2017 19:47:29 Running post build plugin 'Artifactory Release Management Staging'
22-Mar-2017 19:47:29 Running post build plugin 'Artifactory Build Info Copier'
22-Mar-2017 19:47:29 Running post build plugin 'Artifactory Gradle Properties Info Copier'
22-Mar-2017 19:47:30 Running post build plugin 'Post Command Agent Runner'
22-Mar-2017 19:47:30 running post command on agent
22-Mar-2017 19:47:30 build failed, running fail command
22-Mar-2017 19:47:30 command is:
22-Mar-2017 19:47:30 Running post build plugin 'Clover Results Collector'
22-Mar-2017 19:47:30 Running post build plugin 'npm Cache Cleanup'
22-Mar-2017 19:47:30 Running post build plugin 'Artifact Copier'
22-Mar-2017 19:47:30 Publishing an artifact: Test Results
22-Mar-2017 19:47:31 Finished publishing of artifact Shared artifact: [Test Results], pattern: [**/target/surefire-reports/**/*.*] in 1.470 s
22-Mar-2017 19:47:32 Successfully removed working directory at '/opt/bamboo-home/xml-data/build-dir/XD-PUB2-JOB1'
22-Mar-2017 19:47:32 Finalising the build...
22-Mar-2017 19:47:32 Stopping timer.
22-Mar-2017 19:47:32 Build XD-PUB2-JOB1-8 completed.
22-Mar-2017 19:47:32 Running on server: post build plugin 'Post Command Server Runner'
22-Mar-2017 19:47:32 Running on server: post build plugin 'NCover Results Collector'
22-Mar-2017 19:47:32 Running on server: post build plugin 'Build Hanging Detection Configuration'
22-Mar-2017 19:47:32 Running on server: post build plugin 'Clover Delta Calculator'
22-Mar-2017 19:47:33 Running on server: post build plugin 'Maven Dependencies Postprocessor'
22-Mar-2017 19:47:33 All post build plugins have finished
22-Mar-2017 19:47:33 Generating build results summary...
22-Mar-2017 19:47:33 Saving build results to disk...
22-Mar-2017 19:47:33 Logging substituted variables...
22-Mar-2017 19:47:33 Indexing build results...
22-Mar-2017 19:47:33 Finished building XD-PUB2-JOB1-8.