Build: #8 failed Changes by Spring Buildmaster

Build result summary

Details

Completed
Duration
14 minutes
Labels
None
Revision
ec106725c51d245109b2e5055d9f65e43228ecc1 ec106725c51d245109b2e5055d9f65e43228ecc1
No failed tests found, a possible compilation error occurred.

Responsible

Code commits

Author Commit Message Commit date
Spring Buildmaster Spring Buildmaster ec106725c51d245109b2e5055d9f65e43228ecc1 ec106725c51d245109b2e5055d9f65e43228ecc1 [artifactory-release] Next development version
Spring Buildmaster Spring Buildmaster 912bfad751831439ddb1c418160ea5fa695eb860 912bfad751831439ddb1c418160ea5fa695eb860 [artifactory-release] Release version 1.3.2.BUILD

Shared artifacts

Artifact File size
Test Results 0 bytes

Error summary for Build and install XD

The job generated some errors, drill down into the full build log for more details.

        at org.gradle.launcher.cli.JavaRuntimeValidationAction.execute(JavaRuntimeValidationAction.java:35)
        at org.gradle.launcher.cli.JavaRuntimeValidationAction.execute(JavaRuntimeValidationAction.java:24)
        at org.gradle.launcher.cli.CommandLineActionFactory$WithLogging.execute(CommandLineActionFactory.java:206)
        at org.gradle.launcher.cli.CommandLineActionFactory$WithLogging.execute(CommandLineActionFactory.java:169)
        at org.gradle.launcher.cli.ExceptionReportingAction.execute(ExceptionReportingAction.java:33)
        at org.gradle.launcher.cli.ExceptionReportingAction.execute(ExceptionReportingAction.java:22)
        at org.gradle.launcher.Main.doAction(Main.java:33)
        at org.gradle.launcher.bootstrap.EntryPoint.run(EntryPoint.java:45)
        at sun.reflect.NativeMethodAccessorImpl.invoke0(Native Method)
        at sun.reflect.NativeMethodAccessorImpl.invoke(NativeMethodAccessorImpl.java:57)
        at sun.reflect.DelegatingMethodAccessorImpl.invoke(DelegatingMethodAccessorImpl.java:43)
        at java.lang.reflect.Method.invoke(Method.java:606)
        at org.gradle.launcher.bootstrap.ProcessBootstrap.runNoExit(ProcessBootstrap.java:54)
        at org.gradle.launcher.bootstrap.ProcessBootstrap.run(ProcessBootstrap.java:35)
        at org.gradle.launcher.GradleMain.main(GradleMain.java:23)
        at sun.reflect.NativeMethodAccessorImpl.invoke0(Native Method)
        at sun.reflect.NativeMethodAccessorImpl.invoke(NativeMethodAccessorImpl.java:57)
        at sun.reflect.DelegatingMethodAccessorImpl.invoke(DelegatingMethodAccessorImpl.java:43)
        at java.lang.reflect.Method.invoke(Method.java:606)
        at org.gradle.wrapper.BootstrapMainStarter.start(BootstrapMainStarter.java:30)
        at org.gradle.wrapper.WrapperExecutor.execute(WrapperExecutor.java:127)
        at org.gradle.wrapper.GradleWrapperMain.main(GradleWrapperMain.java:55)
19:47:27.777 [ERROR] [org.gradle.BuildExceptionReporter]
19:47:27.784 [ERROR] [org.gradle.BuildExceptionReporter] FAILURE: Build failed with an exception.
19:47:27.784 [ERROR] [org.gradle.BuildExceptionReporter]
19:47:27.784 [ERROR] [org.gradle.BuildExceptionReporter] * What went wrong:
19:47:27.784 [ERROR] [org.gradle.BuildExceptionReporter] Execution failed for task ':artifactoryPublish'.
19:47:27.785 [ERROR] [org.gradle.BuildExceptionReporter] > java.io.IOException: Failed to deploy file: HTTP response code: 401. HTTP response message: Unauthorized
19:47:27.786 [ERROR] [org.gradle.BuildExceptionReporter]
19:47:27.786 [ERROR] [org.gradle.BuildExceptionReporter] * Exception is:
19:47:27.787 [ERROR] [org.gradle.BuildExceptionReporter] org.gradle.api.tasks.TaskExecutionException: Execution failed for task ':artifactoryPublish'.
19:47:27.787 [ERROR] [org.gradle.BuildExceptionReporter]         at org.gradle.api.internal.tasks.execution.ExecuteActionsTaskExecuter.executeActions(ExecuteActionsTaskExecuter.java:69)
19:47:27.788 [ERROR] [org.gradle.BuildExceptionReporter]         at org.gradle.api.internal.tasks.execution.ExecuteActionsTaskExecuter.execute(ExecuteActionsTaskExecuter.java:46)
19:47:27.788 [ERROR] [org.gradle.BuildExceptionReporter]         at org.gradle.api.internal.tasks.execution.PostExecutionAnalysisTaskExecuter.execute(PostExecutionAnalysisTaskExecuter.java:35)
19:47:27.788 [ERROR] [org.gradle.BuildExceptionReporter]         at org.gradle.api.internal.tasks.execution.SkipUpToDateTaskExecuter.execute(SkipUpToDateTaskExecuter.java:64)
19:47:27.789 [ERROR] [org.gradle.BuildExceptionReporter]         at org.gradle.api.internal.tasks.execution.ValidatingTaskExecuter.execute(ValidatingTaskExecuter.java:58)
19:47:27.789 [ERROR] [org.gradle.BuildExceptionReporter]         at org.gradle.api.internal.tasks.execution.SkipEmptySourceFilesTaskExecuter.execute(SkipEmptySourceFilesTaskExecuter.java:42)
19:47:27.789 [ERROR] [org.gradle.BuildExceptionReporter]         at org.gradle.api.internal.tasks.execution.SkipTaskWithNoActionsExecuter.execute(SkipTaskWithNoActionsExecuter.java:52)
19:47:27.790 [ERROR] [org.gradle.BuildExceptionReporter]         at org.gradle.api.internal.tasks.execution.SkipOnlyIfTaskExecuter.execute(SkipOnlyIfTaskExecuter.java:53)
19:47:27.790 [ERROR] [org.gradle.BuildExceptionReporter]         at org.gradle.api.internal.tasks.execution.ExecuteAtMostOnceTaskExecuter.execute(ExecuteAtMostOnceTaskExecuter.java:43)
19:47:27.790 [ERROR] [org.gradle.BuildExceptionReporter]         at org.gradle.api.internal.AbstractTask.executeWithoutThrowingTaskFailure(AbstractTask.java:305)
19:47:27.791 [ERROR] [org.gradle.BuildExceptionReporter]         at org.gradle.execution.taskgraph.AbstractTaskPlanExecutor$TaskExecutorWorker.executeTask(AbstractTaskPlanExecutor.java:79)
19:47:27.791 [ERROR] [org.gradle.BuildExceptionReporter]         at org.gradle.execution.taskgraph.AbstractTaskPlanExecutor$TaskExecutorWorker.processTask(AbstractTaskPlanExecutor.java:63)
19:47:27.791 [ERROR] [org.gradle.BuildExceptionReporter]         at org.gradle.execution.taskgraph.AbstractTaskPlanExecutor$TaskExecutorWorker.run(AbstractTaskPlanExecutor.java:51)
19:47:27.792 [ERROR] [org.gradle.BuildExceptionReporter]         at org.gradle.execution.taskgraph.DefaultTaskPlanExecutor.process(DefaultTaskPlanExecutor.java:23)
19:47:27.792 [ERROR] [org.gradle.BuildExceptionReporter]         at org.gradle.execution.taskgraph.DefaultTaskGraphExecuter.execute(DefaultTaskGraphExecuter.java:88)
19:47:27.792 [ERROR] [org.gradle.BuildExceptionReporter]         at org.gradle.execution.SelectedTaskExecutionAction.execute(SelectedTaskExecutionAction.java:29)
19:47:27.793 [ERROR] [org.gradle.BuildExceptionReporter]         at org.gradle.execution.DefaultBuildExecuter.execute(DefaultBuildExecuter.java:62)
19:47:27.793 [ERROR] [org.gradle.BuildExceptionReporter]         at org.gradle.execution.DefaultBuildExecuter.access$200(DefaultBuildExecuter.java:23)
19:47:27.793 [ERROR] [org.gradle.BuildExceptionReporter]         at org.gradle.execution.DefaultBuildExecuter$2.proceed(DefaultBuildExecuter.java:68)
19:47:27.794 [ERROR] [org.gradle.BuildExceptionReporter]         at org.gradle.execution.DryRunBuildExecutionAction.execute(DryRunBuildExecutionAction.java:32)
19:47:27.794 [ERROR] [org.gradle.BuildExceptionReporter]         at org.gradle.execution.DefaultBuildExecuter.execute(DefaultBuildExecuter.java:62)
19:47:27.794 [ERROR] [org.gradle.BuildExceptionReporter]         at org.gradle.execution.DefaultBuildExecuter.execute(DefaultBuildExecuter.java:55)
19:47:27.795 [ERROR] [org.gradle.BuildExceptionReporter]         at org.gradle.initialization.DefaultGradleLauncher.doBuildStages(DefaultGradleLauncher.java:149)
19:47:27.795 [ERROR] [org.gradle.BuildExceptionReporter]         at org.gradle.initialization.DefaultGradleLauncher.doBuild(DefaultGradleLauncher.java:106)
19:47:27.795 [ERROR] [org.gradle.BuildExceptionReporter]         at org.gradle.initialization.DefaultGradleLauncher.run(DefaultGradleLauncher.java:86)
19:47:27.796 [ERROR] [org.gradle.BuildExceptionReporter]         at org.gradle.launcher.exec.InProcessBuildActionExecuter$DefaultBuildController.run(InProcessBuildActionExecuter.java:80)
19:47:27.796 [ERROR] [org.gradle.BuildExceptionReporter]         at org.gradle.launcher.cli.ExecuteBuildAction.run(ExecuteBuildAction.java:33)
19:47:27.796 [ERROR] [org.gradle.BuildExceptionReporter]         at org.gradle.launcher.cli.ExecuteBuildAction.run(ExecuteBuildAction.java:24)
19:47:27.797 [ERROR] [org.gradle.BuildExceptionReporter]         at org.gradle.launcher.exec.InProcessBuildActionExecuter.execute(InProcessBuildActionExecuter.java:36)
19:47:27.797 [ERROR] [org.gradle.BuildExceptionReporter]         at org.gradle.launcher.exec.InProcessBuildActionExecuter.execute(InProcessBuildActionExecuter.java:26)
19:47:27.797 [ERROR] [org.gradle.BuildExceptionReporter]         at org.gradle.launcher.cli.RunBuildAction.run(RunBuildAction.java:51)
19:47:27.798 [ERROR] [org.gradle.BuildExceptionReporter]         at org.gradle.internal.Actions$RunnableActionAdapter.execute(Actions.java:171)
19:47:27.798 [ERROR] [org.gradle.BuildExceptionReporter]         at org.gradle.launcher.cli.CommandLineActionFactory$ParseAndBuildAction.execute(CommandLineActionFactory.java:237)
19:47:27.798 [ERROR] [org.gradle.BuildExceptionReporter]         at org.gradle.launcher.cli.CommandLineActionFactory$ParseAndBuildAction.execute(CommandLineActionFactory.java:210)
19:47:27.799 [ERROR] [org.gradle.BuildExceptionReporter]         at org.gradle.launcher.cli.JavaRuntimeValidationAction.execute(JavaRuntimeValidationAction.java:35)
19:47:27.799 [ERROR] [org.gradle.BuildExceptionReporter]         at org.gradle.launcher.cli.JavaRuntimeValidationAction.execute(JavaRuntimeValidationAction.java:24)
19:47:27.799 [ERROR] [org.gradle.BuildExceptionReporter]         at org.gradle.launcher.cli.CommandLineActionFactory$WithLogging.execute(CommandLineActionFactory.java:206)
19:47:27.800 [ERROR] [org.gradle.BuildExceptionReporter]         at org.gradle.launcher.cli.CommandLineActionFactory$WithLogging.execute(CommandLineActionFactory.java:169)
19:47:27.800 [ERROR] [org.gradle.BuildExceptionReporter]         at org.gradle.launcher.cli.ExceptionReportingAction.execute(ExceptionReportingAction.java:33)
19:47:27.800 [ERROR] [org.gradle.BuildExceptionReporter]         at org.gradle.launcher.cli.ExceptionReportingAction.execute(ExceptionReportingAction.java:22)
19:47:27.801 [ERROR] [org.gradle.BuildExceptionReporter]         at org.gradle.launcher.Main.doAction(Main.java:33)
19:47:27.801 [ERROR] [org.gradle.BuildExceptionReporter]         at org.gradle.launcher.bootstrap.EntryPoint.run(EntryPoint.java:45)
19:47:27.801 [ERROR] [org.gradle.BuildExceptionReporter]         at org.gradle.launcher.bootstrap.ProcessBootstrap.runNoExit(ProcessBootstrap.java:54)
19:47:27.802 [ERROR] [org.gradle.BuildExceptionReporter]         at org.gradle.launcher.bootstrap.ProcessBootstrap.run(ProcessBootstrap.java:35)
19:47:27.802 [ERROR] [org.gradle.BuildExceptionReporter]         at org.gradle.launcher.GradleMain.main(GradleMain.java:23)
19:47:27.802 [ERROR] [org.gradle.BuildExceptionReporter]         at org.gradle.wrapper.BootstrapMainStarter.start(BootstrapMainStarter.java:30)
19:47:27.803 [ERROR] [org.gradle.BuildExceptionReporter]         at org.gradle.wrapper.WrapperExecutor.execute(WrapperExecutor.java:127)
19:47:27.803 [ERROR] [org.gradle.BuildExceptionReporter]         at org.gradle.wrapper.GradleWrapperMain.main(GradleWrapperMain.java:55)
19:47:27.803 [ERROR] [org.gradle.BuildExceptionReporter] Caused by: org.gradle.internal.UncheckedException: java.io.IOException: Failed to deploy file: HTTP response code: 401. HTTP response message: Unauthorized
19:47:27.804 [ERROR] [org.gradle.BuildExceptionReporter]         at org.gradle.internal.UncheckedException.throwAsUncheckedException(UncheckedException.java:39)
19:47:27.804 [ERROR] [org.gradle.BuildExceptionReporter]         at org.gradle.internal.reflect.JavaMethod.invoke(JavaMethod.java:66)
19:47:27.804 [ERROR] [org.gradle.BuildExceptionReporter]         at org.gradle.api.internal.project.taskfactory.AnnotationProcessingTaskFactory$StandardTaskAction.doExecute(AnnotationProcessingTaskFactory.java:218)
19:47:27.805 [ERROR] [org.gradle.BuildExceptionReporter]         at org.gradle.api.internal.project.taskfactory.AnnotationProcessingTaskFactory$StandardTaskAction.execute(AnnotationProcessingTaskFactory.java:211)
19:47:27.805 [ERROR] [org.gradle.BuildExceptionReporter]         at org.gradle.api.internal.project.taskfactory.AnnotationProcessingTaskFactory$StandardTaskAction.execute(AnnotationProcessingTaskFactory.java:200)
19:47:27.806 [ERROR] [org.gradle.BuildExceptionReporter]         at org.gradle.api.internal.AbstractTask$TaskActionWrapper.execute(AbstractTask.java:579)
19:47:27.806 [ERROR] [org.gradle.BuildExceptionReporter]         at org.gradle.api.internal.AbstractTask$TaskActionWrapper.execute(AbstractTask.java:562)
19:47:27.806 [ERROR] [org.gradle.BuildExceptionReporter]         at org.gradle.api.internal.tasks.execution.ExecuteActionsTaskExecuter.executeAction(ExecuteActionsTaskExecuter.java:80)
19:47:27.807 [ERROR] [org.gradle.BuildExceptionReporter]         at org.gradle.api.internal.tasks.execution.ExecuteActionsTaskExecuter.executeActions(ExecuteActionsTaskExecuter.java:61)
19:47:27.807 [ERROR] [org.gradle.BuildExceptionReporter]         ... 47 more
19:47:27.807 [ERROR] [org.gradle.BuildExceptionReporter] Caused by: java.io.IOException: Failed to deploy file: HTTP response code: 401. HTTP response message: Unauthorized
19:47:27.808 [ERROR] [org.gradle.BuildExceptionReporter]         at org.jfrog.build.extractor.clientConfiguration.client.ArtifactoryBuildInfoClient.throwHttpIOException(ArtifactoryBuildInfoClient.java:744)
19:47:27.808 [ERROR] [org.gradle.BuildExceptionReporter]         at org.jfrog.build.extractor.clientConfiguration.client.ArtifactoryBuildInfoClient.uploadFile(ArtifactoryBuildInfoClient.java:624)
19:47:27.808 [ERROR] [org.gradle.BuildExceptionReporter]         at org.jfrog.build.extractor.clientConfiguration.client.ArtifactoryBuildInfoClient.deployArtifact(ArtifactoryBuildInfoClient.java:330)
19:47:27.809 [ERROR] [org.gradle.BuildExceptionReporter]         at org.jfrog.gradle.plugin.artifactory.task.BuildInfoBaseTask.deployArtifacts(BuildInfoBaseTask.java:409)
19:47:27.809 [ERROR] [org.gradle.BuildExceptionReporter]         at org.jfrog.gradle.plugin.artifactory.task.BuildInfoBaseTask.prepareAndDeploy(BuildInfoBaseTask.java:284)
19:47:27.809 [ERROR] [org.gradle.BuildExceptionReporter]         at org.jfrog.gradle.plugin.artifactory.task.BuildInfoBaseTask.collectProjectBuildInfo(BuildInfoBaseTask.java:363)
19:47:27.810 [ERROR] [org.gradle.BuildExceptionReporter]         at org.gradle.internal.reflect.JavaMethod.invoke(JavaMethod.java:63)
19:47:27.810 [ERROR] [org.gradle.BuildExceptionReporter]         ... 54 more
19:47:27.810 [ERROR] [org.gradle.BuildExceptionReporter]