Windows 2008 x86_64 EC2 build

Build: #264 failed Changes by Gunnar Hillert

Build result summary

Details

Completed
Duration
41 minutes
Labels
None
Agent
(elastic) Elastic Agent on i-27e7778f
Revision
e18541c4568289c911d7f7d48a8fee2317ca886a e18541c4568289c911d7f7d48a8fee2317ca886a
Total tests
700
Fixed in
#265 (Changes by Thomas Risberg)

Tests

Responsible

No one has taken responsibility for this failure

Code commits

Author Commit Message Commit date
Gunnar Hillert Gunnar Hillert e18541c4568289c911d7f7d48a8fee2317ca886a e18541c4568289c911d7f7d48a8fee2317ca886a XD-631 Pluralize test classes
* Pluralize test classes in package org.springframework.xd.shell.command

Tests

New test failures 2
Status Test View job Duration
Collapse Failed ExampleProcessingChainTests testProcessingChain History
Default Job 6 secs
java.lang.ClassCastException: java.lang.ClassCastException: org.joda.time.DateTime cannot be cast to java.lang.String
java.lang.ClassCastException: org.joda.time.DateTime cannot be cast to java.lang.String
	at org.springframework.xd.dirt.stream.ExampleProcessingChainTests.testProcessingChain(ExampleProcessingChainTests.java:81)
	at sun.reflect.NativeMethodAccessorImpl.invoke0(Native Method)
	at sun.reflect.NativeMethodAccessorImpl.invoke(NativeMethodAccessorImpl.java:62)
	at sun.reflect.DelegatingMethodAccessorImpl.invoke(DelegatingMethodAccessorImpl.java:43)
	at java.lang.reflect.Method.invoke(Method.java:483)
	at org.junit.runners.model.FrameworkMethod$1.runReflectiveCall(FrameworkMethod.java:50)
(37 more lines...)
Collapse Failed ExampleProcessingChainTests processingChain History
Default Job 7 secs
java.lang.AssertionError: java.lang.AssertionError: expected:<HELLO> but was:<null>
java.lang.AssertionError: expected:<HELLO> but was:<null>
	at org.junit.Assert.fail(Assert.java:88)
	at org.junit.Assert.failNotEquals(Assert.java:834)
	at org.junit.Assert.assertEquals(Assert.java:118)
	at org.junit.Assert.assertEquals(Assert.java:144)
	at org.springframework.xd.dirt.stream.ExampleProcessingChainTests.processingChain(ExampleProcessingChainTests.java:106)
	at sun.reflect.NativeMethodAccessorImpl.invoke0(Native Method)
(41 more lines...)

Jira issues

IssueDescriptionStatus
Unknown Issue TypeXD-631Could not obtain issue details from Jira