Windows 2008 x86_64 EC2 build

Build: #282 failed Changes by David Turanski <dturanski@pivotal.io>

Build result summary

Details

Completed
Duration
47 minutes
Labels
None
Agent
(elastic) Elastic Agent on i-c3131a60
Revision
d6dc9c601bf4748bca6cd5fc0918c2c95efce020 d6dc9c601bf4748bca6cd5fc0918c2c95efce020
Total tests
864
Fixed in
#285 (Manual run by Mark Pollack)

Tests

Responsible

No one has taken responsibility for this failure

Code commits

Author Commit Message Commit date
David Turanski <dturanski@pivotal.io> David Turanski <dturanski@pivotal.io> d6dc9c601bf4748bca6cd5fc0918c2c95efce020 d6dc9c601bf4748bca6cd5fc0918c2c95efce020 XD-3125, XD-3126 support custom serialization
Refactor SharedServerContextConfiguration
Refactor to use KryoRegistrar interface
Remove duplicate implementation of overriden method.
Change AbstractKryoMultiTypeCodec to directly create Kryo input from byte[]
Ensure closing of input streams in try/finally block in Codecs
Fixed import and type warnings

Tests

New test failures 1
Status Test View job Duration
Collapse Failed FileSourceModuleTests testFileContentsUsingDefaultMode History
Default Job 3 secs
java.lang.AssertionError: java.lang.AssertionError
java.lang.AssertionError
	at org.junit.Assert.fail(Assert.java:86)
	at org.junit.Assert.assertTrue(Assert.java:41)
	at org.junit.Assert.assertTrue(Assert.java:52)
	at org.springframework.xd.dirt.stream.FileSourceModuleTests.testFileContentsUsingDefaultMode(FileSourceModuleTests.java:154)
	at sun.reflect.NativeMethodAccessorImpl.invoke0(Native Method)
	at sun.reflect.NativeMethodAccessorImpl.invoke(NativeMethodAccessorImpl.java:62)
(41 more lines...)

Jira issues

IssueDescriptionStatus
Unknown Issue TypeXD-3125Could not obtain issue details from Jira
Unknown Issue TypeXD-3126Could not obtain issue details from Jira