Windows 2008 x86_64 EC2 build

Build: #283 failed Changes by Ilayaperumal Gopinathan

Build result summary

Details

Completed
Duration
56 minutes
Labels
None
Agent
(elastic) Elastic Agent on i-c3131a60
Revision
9307f1fba347adf59c8b489ae7fe0aa9bfd9b6a6 9307f1fba347adf59c8b489ae7fe0aa9bfd9b6a6
Total tests
1316
Failing since
#282 (Changes by David Turanski <dturanski@pivotal.io>)
Fixed in
#285 (Manual run by Mark Pollack)

Responsible

This build has been failing since #282
No one has taken responsibility

Code commits

Author Commit Message Commit date
Ilayaperumal Gopinathan Ilayaperumal Gopinathan 9307f1fba347adf59c8b489ae7fe0aa9bfd9b6a6 9307f1fba347adf59c8b489ae7fe0aa9bfd9b6a6 Ignore spark app test
 - ignoring it until the spark standalone cluster acceptance test environment is setup with 1.3.1
Ilayaperumal Gopinathan Ilayaperumal Gopinathan 14290756ea205ac76898e32ef689f7a6967a0e85 14290756ea205ac76898e32ef689f7a6967a0e85 Suppress compiler warnings

Tests

New test failures 1
Status Test View job Duration
Collapse Failed LocalTransportSparkStreamingTests testSparkFileLoggerWithInputType History
Default Job 42 secs
java.lang.AssertionError: java.lang.AssertionError: 
Expected: a string ending with "foo foo foo\r\n", trying at most 50 times
     but: failed after 50*100=5000ms:
"", "", "", "", "", "", "", "", 
java.lang.AssertionError: 
Expected: a string ending with "foo foo foo\r\n", trying at most 50 times
     but: failed after 50*100=5000ms:
"", "", "", "", "", "", "", "", 
(50 more lines...)
Fixed tests 1
Status Test Failing since View job Duration
Successful FileSourceModuleTests testFileContentsUsingDefaultMode History
Failing since build #282 (Changes by David Turanski <dturanski@pivotal.io>) Default Job 2 secs