Windows 2008 x86_64 EC2 build

Build: #283 failed Changes by Ilayaperumal Gopinathan

Test results

  • 1,316 tests in total
  • 1 test failed
  • 1 failure is new
  • 1 test was fixed
  • 93 tests were quarantined / skipped
  • 39 minutes taken in total.
New test failures 1
Status Test View job Duration
Collapse Failed LocalTransportSparkStreamingTests testSparkFileLoggerWithInputType History
Default Job 42 secs
java.lang.AssertionError: java.lang.AssertionError: 
Expected: a string ending with "foo foo foo\r\n", trying at most 50 times
     but: failed after 50*100=5000ms:
"", "", "", "", "", "", "", "", 
java.lang.AssertionError: 
Expected: a string ending with "foo foo foo\r\n", trying at most 50 times
     but: failed after 50*100=5000ms:
"", "", "", "", "", "", "", "", 
(50 more lines...)
Fixed tests 1
Status Test Failing since View job Duration
Successful FileSourceModuleTests testFileContentsUsingDefaultMode History
Failing since build #282 (Changes by David Turanski <dturanski@pivotal.io>) Default Job 2 secs
Skipped tests 93
Status Test Failing since View job
Skipped RabbitSingleNodeInitializationTests environmentMatchesTransport History
Default Job
Skipped KafkaMessageBusTests testCustomPartitionCountDoesNotOverrideModuleCountAndConcurrencyIfSmaller History
Default Job
Skipped KafkaMessageBusTests testCompression History
Default Job
Skipped KafkaMessageBusTests testCustomPartitionCountOverridesDefaultIfLarger History
Default Job
Skipped KafkaMessageBusTests createInboundPubSubBeforeOutboundPubSub History
Default Job
Skipped KafkaMessageBusTests testKafkaSpecificProducerPropertiesAreSet History
Default Job
Skipped KafkaMessageBusTests testSendAndReceive History
Default Job
Skipped KafkaMessageBusTests testBadDynamic History
Default Job
Skipped KafkaMessageBusTests testSendAndReceivePubSub History
Default Job
Skipped KafkaMessageBusTests testCustomPartitionCountOverridesPartitioningIfLarger History
Default Job
Skipped KafkaMessageBusTests testCustomPartitionCountOverridesModuleCountAndConcurrencyIfLarger History
Default Job
Skipped KafkaMessageBusTests testCustomPartitionCountDoesNotOverridePartitioningIfSmaller History
Default Job
Skipped KafkaMessageBusTests testSendAndReceiveNoOriginalContentType History
Default Job
Skipped KafkaMessageBusTests testDirectBinding History
Default Job
Skipped KafkaMessageBusTests testPartitionedModuleJava History
Default Job
Skipped KafkaMessageBusTests testBadProperties History
Default Job
Skipped KafkaMessageBusTests testKafkaSpecificConsumerPropertiesAreSet History
Default Job
Skipped KafkaMessageBusTests testPartitionedModuleSpEL History
Default Job
Skipped KafkaMessageBusTests testClean History
Default Job
Skipped RawModeKafkaMessageBusTests testPartitionedModuleJava History
Default Job
Skipped RawModeKafkaMessageBusTests testCustomPartitionCountOverridesModuleCountAndConcurrencyIfLarger History
Default Job
Skipped RawModeKafkaMessageBusTests testDirectBinding History
Default Job
Skipped RawModeKafkaMessageBusTests testBadProperties History
Default Job
Skipped RawModeKafkaMessageBusTests testBadDynamic History
Default Job
Skipped RawModeKafkaMessageBusTests testSendAndReceivePubSub History
Default Job
Skipped RawModeKafkaMessageBusTests testClean History
Default Job
Skipped RawModeKafkaMessageBusTests testCustomPartitionCountDoesNotOverridePartitioningIfSmaller History
Default Job
Skipped RawModeKafkaMessageBusTests testSendAndReceiveNoOriginalContentType History
Default Job
Skipped RawModeKafkaMessageBusTests testCustomPartitionCountOverridesPartitioningIfLarger History
Default Job
Skipped RawModeKafkaMessageBusTests testKafkaSpecificProducerPropertiesAreSet History
Default Job
Skipped RawModeKafkaMessageBusTests testCustomPartitionCountDoesNotOverrideModuleCountAndConcurrencyIfSmaller History
Default Job
Skipped RawModeKafkaMessageBusTests testSendAndReceive History
Default Job
Skipped RawModeKafkaMessageBusTests testCompression History
Default Job
Skipped RawModeKafkaMessageBusTests testCustomPartitionCountOverridesDefaultIfLarger History
Default Job
Skipped RawModeKafkaMessageBusTests testKafkaSpecificConsumerPropertiesAreSet History
Default Job
Skipped RawModeKafkaMessageBusTests testPartitionedModuleSpEL History
Default Job
Skipped RawModeKafkaMessageBusTests createInboundPubSubBeforeOutboundPubSub History
Default Job
Skipped RabbitBusCleanerTests testCleanStream History
Default Job
Skipped RabbitBusCleanerTests testCleanJob History
Default Job
Skipped RabbitMessageBusTests testDirectBinding History
Default Job
Skipped RabbitMessageBusTests testAutoBindDLQ History
Default Job
Skipped RabbitMessageBusTests testSendAndReceiveNoOriginalContentType History
Default Job
Skipped RabbitMessageBusTests testProducerProperties History
Default Job
Skipped RabbitMessageBusTests testAutoBindDLQwithRepublish History
Default Job
Skipped RabbitMessageBusTests testBadProperties History
Default Job
Skipped RabbitMessageBusTests testSendAndReceive History
Default Job
Skipped RabbitMessageBusTests testBadDynamic History
Default Job
Skipped RabbitMessageBusTests testDurablePubSubWithAutoBindDLQ History
Default Job
Skipped RabbitMessageBusTests testClean History
Default Job
Skipped RabbitMessageBusTests testNonDurablePubSubWithAutoBindDLQ History
Default Job
Skipped RabbitMessageBusTests testRequestReplyRequestorProperties History
Default Job
Skipped RabbitMessageBusTests testPartitionedModuleSpEL History
Default Job
Skipped RabbitMessageBusTests testSendAndReceiveBad History
Default Job
Skipped RabbitMessageBusTests testRequestReplyReplierProperties History
Default Job
Skipped RabbitMessageBusTests testBatchingAndCompression History
Default Job
Skipped RabbitMessageBusTests createInboundPubSubBeforeOutboundPubSub History
Default Job
Skipped RabbitMessageBusTests testConsumerProperties History
Default Job
Skipped RabbitMessageBusTests testPartitionedModuleJava History
Default Job
Skipped RabbitMessageBusTests testSendAndReceivePubSub History
Default Job
Skipped RabbitJobPluginTests partitionedJob History
Default Job
Skipped RabbitJobPluginTests jobOptionsDefaults History
Default Job
Skipped RabbitJobPluginTests streamComponentsAdded History
Default Job
Skipped RabbitJobPluginTests testThatInputOutputChannelsAreBound History
Default Job
Skipped RabbitJobPluginTests testThatJobEventsChannelsAreBound History
Default Job
Skipped RabbitJobPluginTests streamNameAdded History
Default Job
Skipped ShellCommandProcessorTests quotedStringTest History
Default Job
Skipped ShellCommandProcessorTests testUTF8 History
Default Job
Skipped ShellCommandProcessorTests testEnvironment History
Default Job
Skipped ShellCommandProcessorTests echoTestWithLFEncoder History
Default Job
Skipped ShellCommandProcessorTests doConcurrentTest History
Default Job
Skipped ShellCommandProcessorTests echoTest History
Default Job
Skipped ShellCommandProcessorTests testWorkingDirectory History
Default Job
Skipped ShellCommandProcessorTests testError History
Default Job
Skipped DatasetOutboundChannelAdapterIntegrationTests testWritingDataset History
Default Job
Skipped DatasetOutboundChannelAdapterPartitionedIntegrationTests testWritingDataset History
Default Job
Skipped HdfsOutboundChannelAdapterIntegrationTests testWritesWithRollover History
Default Job
Skipped HdfsOutboundChannelAdapterIntegrationTests testWritesWithPartition History
Default Job
Skipped KafkaSourceSinkTests testKafkaSourceAndSinkWithMultiTopics History
Default Job
Skipped KafkaSourceSinkTests testKafkaSourceAndSink History
Default Job
Skipped MetricsTests testFieldValueCounterDisplay History
Default Job
Skipped MetricsTests testFieldValueCounterList History
Default Job
Skipped SftpSourceTests testSftpSourceWithFileNameRegexPattern History
Default Job
Skipped SftpSourceTests testSftpSourceWithFileNamePattern History
Default Job
Skipped SftpSourceTests testSftpSource History
Default Job
Skipped StreamCommandsTests testJsonPath History
Default Job
Skipped KafkaSourceSinkWithSecurityTests testKafkaSourceAndSink History
Default Job
Skipped KafkaSourceSinkWithSecurityTests testKafkaSourceAndSinkWithMultiTopics History
Default Job
Skipped MetricsWithSecurityTests testFieldValueCounterDisplay History
Default Job
Skipped MetricsWithSecurityTests testFieldValueCounterList History
Default Job
Skipped SftpSourceWithSecurityTests testSftpSource History
Default Job
Skipped SftpSourceWithSecurityTests testSftpSourceWithFileNameRegexPattern History
Default Job
Skipped SftpSourceWithSecurityTests testSftpSourceWithFileNamePattern History
Default Job
Skipped StreamCommandsWithSecurityTests testJsonPath History
Default Job