Windows 2008 x86_64 EC2 build

Build: #320 failed Changes by Michael Minella

Build result summary

Details

Completed
Duration
49 minutes
Labels
None
Agent
(elastic) Elastic Agent on i-ec260953
Revision
db9bfece476417c328f8a4bbaaebc8a923aa8c03 db9bfece476417c328f8a4bbaaebc8a923aa8c03
Total tests
974
Failing since
#319 (Changes by Gunnar Hillert)
Fixed in
#321 (Changes by Martin Macko <macko.mar@gmail.com>)

Responsible

This build has been failing since #319
No one has taken responsibility

Code commits

Author Commit Message Commit date
Michael Minella Michael Minella db9bfece476417c328f8a4bbaaebc8a923aa8c03 db9bfece476417c328f8a4bbaaebc8a923aa8c03 Fixed passing of parameters from parent to child job

Tests

New test failures 1
Status Test View job Duration
Collapse Failed FileSourceModuleTests testFileContentsUsingDefaultMode History
Default Job 4 secs
java.lang.AssertionError: java.lang.AssertionError
java.lang.AssertionError
	at org.junit.Assert.fail(Assert.java:86)
	at org.junit.Assert.assertTrue(Assert.java:41)
	at org.junit.Assert.assertTrue(Assert.java:52)
	at org.springframework.xd.dirt.stream.FileSourceModuleTests.testFileContentsUsingDefaultMode(FileSourceModuleTests.java:154)
	at sun.reflect.NativeMethodAccessorImpl.invoke0(Native Method)
	at sun.reflect.NativeMethodAccessorImpl.invoke(NativeMethodAccessorImpl.java:62)
(41 more lines...)
Fixed tests 1
Status Test Failing since View job Duration
Successful RedisQueueInboundChannelAdapterTests testCustomPayloadSerializer History
Failing since build #319 (Changes by Gunnar Hillert) Default Job < 1 sec