Windows 2008 x86_64 EC2 build

Build: #323 failed Changes by Mark Pollack

Build result summary

Details

Completed
Duration
46 minutes
Labels
None
Agent
(elastic) Elastic Agent on i-7c7658c3
Revision
17744958dfacc050f394f6720cd7b40198438b04 17744958dfacc050f394f6720cd7b40198438b04
Total tests
1412
Fixed in
#324 (Changes by 3 people)

Tests

Responsible

Code commits

Author Commit Message Commit date
Mark Pollack Mark Pollack 17744958dfacc050f394f6720cd7b40198438b04 17744958dfacc050f394f6720cd7b40198438b04 Update UI version to 1.3 RC1
Mark Pollack Mark Pollack 5ea0fb39b9c5c146453f0541b68aac440cad2e38 5ea0fb39b9c5c146453f0541b68aac440cad2e38 Update version numbers in docs for 1.3 RC1 release

Tests

New test failures 1
Status Test View job Duration
Collapse Failed JobCommandsWithSecurityTests doStopJobExecution History
Default Job 42 secs
java.lang.AssertionError: java.lang.AssertionError: Failure.  CommandResult = CommandResult [success=false, result=null, exception=org.springframework.xd.rest.client.impl.SpringXDException: Job execution with executionId 5 is not running.
]
java.lang.AssertionError: Failure.  CommandResult = CommandResult [success=false, result=null, exception=org.springframework.xd.rest.client.impl.SpringXDException: Job execution with executionId 5 is not running.
]
	at org.junit.Assert.fail(Assert.java:88)
	at org.junit.Assert.assertTrue(Assert.java:41)
	at org.springframework.xd.shell.AbstractShellIntegrationTest.executeCommand(AbstractShellIntegrationTest.java:197)
	at org.springframework.xd.shell.command.AbstractJobCommandsTests.doStopJobExecution(AbstractJobCommandsTests.java:470)
(62 more lines...)