Windows 2008 x86_64 EC2 build

Build: #325 failed Changes by BoykoAlex <aboyko@pivotal.io>

Build result summary

Details

Completed
Duration
56 minutes
Labels
None
Agent
(elastic) Elastic Agent on i-a8330317
Revision
3c3fa4c6217c3a43f180ee2e5e2ae54d89861333 3c3fa4c6217c3a43f180ee2e5e2ae54d89861333
Total tests
947
Fixed in
#328 (Changes by Glenn Renfro)

Tests

Responsible

No one has taken responsibility for this failure

Code commits

Author Commit Message Commit date
BoykoAlex <aboyko@pivotal.io> BoykoAlex <aboyko@pivotal.io> 3c3fa4c6217c3a43f180ee2e5e2ae54d89861333 3c3fa4c6217c3a43f180ee2e5e2ae54d89861333 DSL<->Graph conversion endpoint takes request body instead request param

Tests

New test failures 2
Status Test View job Duration
Collapse Failed SingleNodeApplicationWithDefaultSecurityTest testSslNotEnabledByDefaultForManagementEndpoints History
Default Job 3 secs
org.springframework.web.client.ResourceAccessException: org.springframework.web.client.ResourceAccessException: I/O error on GET request for "http://localhost:26524/management/metrics":Read timed out; nested exception is java.net.SocketTimeoutException: Read timed out
org.springframework.web.client.ResourceAccessException: I/O error on GET request for "http://localhost:26524/management/metrics":Read timed out; nested exception is java.net.SocketTimeoutException: Read timed out
	at org.springframework.web.client.RestTemplate.doExecute(RestTemplate.java:607)
	at org.springframework.web.client.RestTemplate.execute(RestTemplate.java:557)
	at org.springframework.web.client.RestTemplate.getForEntity(RestTemplate.java:289)
	at org.springframework.xd.dirt.security.SingleNodeApplicationWithDefaultSecurityTest.testSslNotEnabledByDefaultForManagementEndpoints(SingleNodeApplicationWithDefaultSecurityTest.java:95)
	at sun.reflect.NativeMethodAccessorImpl.invoke0(Native Method)
	at sun.reflect.NativeMethodAccessorImpl.invoke(NativeMethodAccessorImpl.java:62)
(60 more lines...)
Collapse Failed FileSourceModuleTests testFileContentsUsingDefaultMode History
Default Job 4 secs
java.lang.AssertionError: java.lang.AssertionError
java.lang.AssertionError
	at org.junit.Assert.fail(Assert.java:86)
	at org.junit.Assert.assertTrue(Assert.java:41)
	at org.junit.Assert.assertTrue(Assert.java:52)
	at org.springframework.xd.dirt.stream.FileSourceModuleTests.testFileContentsUsingDefaultMode(FileSourceModuleTests.java:154)
	at sun.reflect.NativeMethodAccessorImpl.invoke0(Native Method)
	at sun.reflect.NativeMethodAccessorImpl.invoke(NativeMethodAccessorImpl.java:62)
(41 more lines...)