Windows 2008 x86_64 EC2 build

Build: #326 failed Changes by Andy Clement

Build result summary

Details

Completed
Duration
53 minutes
Labels
None
Agent
(elastic) Elastic Agent on i-266f5099
Revision
b8f7fd10df576f2fcd95a2b54fd6c7287ed001fc b8f7fd10df576f2fcd95a2b54fd6c7287ed001fc
Total tests
950
Failing since
#325 (Changes by BoykoAlex <aboyko@pivotal.io>)
Fixed in
#328 (Changes by Glenn Renfro)

Responsible

This build has been failing since #325
No one has taken responsibility

Code commits

Author Commit Message Commit date
Andy Clement Andy Clement b8f7fd10df576f2fcd95a2b54fd6c7287ed001fc b8f7fd10df576f2fcd95a2b54fd6c7287ed001fc JobsDSL: better graph building algorithm for flows
- improved text to graph creation for flows
- improved DSL creation from graph
- Fixed tokenizer problem when whitespace not supplied

Tests

Existing test failures 1
Status Test Failing since View job Duration
java.lang.AssertionError: java.lang.AssertionError
java.lang.AssertionError
	at org.junit.Assert.fail(Assert.java:86)
	at org.junit.Assert.assertTrue(Assert.java:41)
	at org.junit.Assert.assertTrue(Assert.java:52)
	at org.springframework.xd.dirt.stream.FileSourceModuleTests.testFileContentsUsingDefaultMode(FileSourceModuleTests.java:154)
	at sun.reflect.NativeMethodAccessorImpl.invoke0(Native Method)
	at sun.reflect.NativeMethodAccessorImpl.invoke(NativeMethodAccessorImpl.java:62)
(41 more lines...)
Fixed tests 1
Status Test Failing since View job Duration
Successful SingleNodeApplicationWithDefaultSecurityTest testSslNotEnabledByDefaultForManagementEndpoints History
Failing since build #325 (Changes by BoykoAlex <aboyko@pivotal.io>) Default Job < 1 sec