Windows 2008 x86_64 EC2 build

Build: #327 failed Changes by Gunnar Hillert

Build result summary

Details

Completed
Duration
89 minutes
Labels
None
Agent
(elastic) Elastic Agent on i-e99ba556
Revision
30aedf2a6aa72fbbcc6b9119ab7fb2e58e035bdd 30aedf2a6aa72fbbcc6b9119ab7fb2e58e035bdd
Total tests
1412
Failing since
#325 (Changes by BoykoAlex <aboyko@pivotal.io>)
Fixed in
#328 (Changes by Glenn Renfro)

Responsible

This build has been failing since #325
No one has taken responsibility

Code commits

Author Commit Message Commit date
Gunnar Hillert Gunnar Hillert 30aedf2a6aa72fbbcc6b9119ab7fb2e58e035bdd 30aedf2a6aa72fbbcc6b9119ab7fb2e58e035bdd XD-3655 Document admin-ui improvements

Tests

New test failures 1
Status Test View job Duration
Collapse Failed LocalTransportSparkStreamingTests testSparkScalaProcessorWithInputType History
Default Job 1 sec
org.springframework.beans.factory.BeanCreationException: org.springframework.beans.factory.BeanCreationException: Error creating bean with name 'org.springframework.xd.batch.hsqldb.server.HSQLServerBean#0' defined in class path resource [org/springframework/xd/batch/hsql-datasource.xml]: Invocation of init method failed; nested exception is java.lang.IllegalStateException: HSQLDB could not be started on 0.0.0.0:57483, state: SHUTDOWN
org.springframework.beans.factory.BeanCreationException: Error creating bean with name 'org.springframework.xd.batch.hsqldb.server.HSQLServerBean#0' defined in class path resource [org/springframework/xd/batch/hsql-datasource.xml]: Invocation of init method failed; nested exception is java.lang.IllegalStateException: HSQLDB could not be started on 0.0.0.0:57483, state: SHUTDOWN
	at org.springframework.beans.factory.support.AbstractAutowireCapableBeanFactory.initializeBean(AbstractAutowireCapableBeanFactory.java:1578)
	at org.springframework.beans.factory.support.AbstractAutowireCapableBeanFactory.doCreateBean(AbstractAutowireCapableBeanFactory.java:545)
	at org.springframework.beans.factory.support.AbstractAutowireCapableBeanFactory.createBean(AbstractAutowireCapableBeanFactory.java:482)
	at org.springframework.beans.factory.support.AbstractBeanFactory$1.getObject(AbstractBeanFactory.java:305)
	at org.springframework.beans.factory.support.DefaultSingletonBeanRegistry.getSingleton(DefaultSingletonBeanRegistry.java:230)
	at org.springframework.beans.factory.support.AbstractBeanFactory.doGetBean(AbstractBeanFactory.java:301)
(76 more lines...)
Fixed tests 1
Status Test Failing since View job Duration
Successful FileSourceModuleTests testFileContentsUsingDefaultMode History
Failing since build #325 (Changes by BoykoAlex <aboyko@pivotal.io>) Default Job 3 secs

Jira issues

IssueDescriptionStatus
Unknown Issue TypeXD-3655Could not obtain issue details from Jira