Windows 2008 x86_64 EC2 build

Build result summary

Details

Completed
Duration
74 minutes
Labels
None
Agent
(elastic) Elastic Agent on i-336c9a8d
Revision
980d2a6b7467cd4e271c33ed24490ef9feae4bcf 980d2a6b7467cd4e271c33ed24490ef9feae4bcf
Total tests
1390
Fixed in
#334 (Changes by Gary Russell)

Tests

Responsible

  • mbg_at_pivotal mbg_at_pivotal Automatically assigned

Code commits

Author Commit Message Commit date
Marius Bogoevici <mbogoevici@pivotal.io> Marius Bogoevici <mbogoevici@pivotal.io> 980d2a6b7467cd4e271c33ed24490ef9feae4bcf 980d2a6b7467cd4e271c33ed24490ef9feae4bcf XD-3621 Kafka bus: Pass header propagation config
Allow the headers passed by the kafka bus to be configured.

Update kafka-bus.xml

Polishing

Polishing on Kafka tests

Tests

New test failures 1
Status Test View job Duration
Collapse Failed JobCommandsWithSecurityTests doStopJobExecution History
Default Job 42 secs
java.lang.AssertionError: java.lang.AssertionError: Failure.  CommandResult = CommandResult [success=false, result=null, exception=org.springframework.xd.rest.client.impl.SpringXDException: Job execution with executionId 5 is not running.
]
java.lang.AssertionError: Failure.  CommandResult = CommandResult [success=false, result=null, exception=org.springframework.xd.rest.client.impl.SpringXDException: Job execution with executionId 5 is not running.
]
	at org.junit.Assert.fail(Assert.java:88)
	at org.junit.Assert.assertTrue(Assert.java:41)
	at org.springframework.xd.shell.AbstractShellIntegrationTest.executeCommand(AbstractShellIntegrationTest.java:197)
	at org.springframework.xd.shell.command.AbstractJobCommandsTests.doStopJobExecution(AbstractJobCommandsTests.java:470)
(62 more lines...)

Jira issues

IssueDescriptionStatus
Unknown Issue TypeXD-3621Could not obtain issue details from Jira