Windows 2008 x86_64 EC2 build

Build: #338 failed Changes by Michael Minella

Build result summary

Details

Completed
Duration
69 minutes
Labels
None
Agent
(elastic) Elastic Agent on i-0f59f7b1
Revision
274e1c747dd556d4125ec16cb0366579765e2cb5 274e1c747dd556d4125ec16cb0366579765e2cb5
Total tests
1390
Fixed in
#339 (Changes by Gary Russell)

Tests

Responsible

Code commits

Author Commit Message Commit date
Michael Minella Michael Minella 274e1c747dd556d4125ec16cb0366579765e2cb5 274e1c747dd556d4125ec16cb0366579765e2cb5 Updated job repository configuration to be consistent across container and admin

Tests

New test failures 1
Status Test View job Duration
Collapse Failed JobCommandsWithSecurityTests doStopJobExecution History
Default Job 42 secs
java.lang.AssertionError: java.lang.AssertionError: Failure.  CommandResult = CommandResult [success=false, result=null, exception=org.springframework.xd.rest.client.impl.SpringXDException: Job execution with executionId 5 is not running.
]
java.lang.AssertionError: Failure.  CommandResult = CommandResult [success=false, result=null, exception=org.springframework.xd.rest.client.impl.SpringXDException: Job execution with executionId 5 is not running.
]
	at org.junit.Assert.fail(Assert.java:88)
	at org.junit.Assert.assertTrue(Assert.java:41)
	at org.springframework.xd.shell.AbstractShellIntegrationTest.executeCommand(AbstractShellIntegrationTest.java:197)
	at org.springframework.xd.shell.command.AbstractJobCommandsTests.doStopJobExecution(AbstractJobCommandsTests.java:470)
(62 more lines...)