Windows 2008 x86_64 EC2 build

Build: #346 failed Changes by Mark Pollack

Build result summary

Details

Completed
Duration
52 minutes
Labels
None
Agent
(elastic) Elastic Agent on i-618e05df
Revision
4dc762a4c40263e0d4e5a21879febf977cdd2383 4dc762a4c40263e0d4e5a21879febf977cdd2383
Total tests
1402
Fixed in
#348 (Changes by Mark Pollack)

Tests

Responsible

Code commits

Author Commit Message Commit date
Mark Pollack Mark Pollack 4dc762a4c40263e0d4e5a21879febf977cdd2383 4dc762a4c40263e0d4e5a21879febf977cdd2383 Update version numbers in misc files/docs to 1.3.0.RELEASE

Tests

New test failures 1
Status Test View job Duration
Collapse Failed JobCommandsWithSecurityTests doStopJobExecution History
Default Job 42 secs
java.lang.AssertionError: java.lang.AssertionError: Failure.  CommandResult = CommandResult [success=false, result=null, exception=org.springframework.xd.rest.client.impl.SpringXDException: Job execution with executionId 5 is not running.
]
java.lang.AssertionError: Failure.  CommandResult = CommandResult [success=false, result=null, exception=org.springframework.xd.rest.client.impl.SpringXDException: Job execution with executionId 5 is not running.
]
	at org.junit.Assert.fail(Assert.java:88)
	at org.junit.Assert.assertTrue(Assert.java:41)
	at org.springframework.xd.shell.AbstractShellIntegrationTest.executeCommand(AbstractShellIntegrationTest.java:197)
	at org.springframework.xd.shell.command.AbstractJobCommandsTests.doStopJobExecution(AbstractJobCommandsTests.java:470)
(62 more lines...)