Windows 2008 x86_64 EC2 build

Build: #347 failed Changes by Thomas Risberg

Build result summary

Details

Completed
Duration
52 minutes
Labels
None
Agent
(elastic) Elastic Agent on i-618e05df
Revision
d7d2abfb9ae801e7165902cb57bfa124af6c66e2 d7d2abfb9ae801e7165902cb57bfa124af6c66e2
Total tests
1402
Failing since
#346 (Changes by Mark Pollack)
Fixed in
#348 (Changes by Mark Pollack)

Responsible

Code commits

Author Commit Message Commit date
Thomas Risberg Thomas Risberg d7d2abfb9ae801e7165902cb57bfa124af6c66e2 d7d2abfb9ae801e7165902cb57bfa124af6c66e2 XD-3690 Updating Database Configuration section and sink/source/job docs

Tests

Existing test failures 1
Status Test Failing since View job Duration
java.lang.AssertionError: java.lang.AssertionError: Failure.  CommandResult = CommandResult [success=false, result=null, exception=org.springframework.xd.rest.client.impl.SpringXDException: Job execution with executionId 5 is not running.
]
java.lang.AssertionError: Failure.  CommandResult = CommandResult [success=false, result=null, exception=org.springframework.xd.rest.client.impl.SpringXDException: Job execution with executionId 5 is not running.
]
	at org.junit.Assert.fail(Assert.java:88)
	at org.junit.Assert.assertTrue(Assert.java:41)
	at org.springframework.xd.shell.AbstractShellIntegrationTest.executeCommand(AbstractShellIntegrationTest.java:197)
	at org.springframework.xd.shell.command.AbstractJobCommandsTests.doStopJobExecution(AbstractJobCommandsTests.java:470)
(62 more lines...)

Jira issues

IssueDescriptionStatus
Unknown Issue TypeXD-3690Could not obtain issue details from Jira