Windows 2008 x86_64 EC2 build

Build: #354 failed Changes by Gary Russell

Build result summary

Details

Completed
Duration
57 minutes
Labels
None
Agent
(elastic) Elastic Agent on i-ed58fa6d
Revision
8323aa0b68a76039b381674ef176ebd54701a170 8323aa0b68a76039b381674ef176ebd54701a170
Total tests
964
Failing since
#353 (Changes by Gary Russell)
Fixed in
#362 (Manual run by Mark Pollack)

Tests

Responsible

Code commits

Author Commit Message Commit date
Gary Russell Gary Russell 8323aa0b68a76039b381674ef176ebd54701a170 8323aa0b68a76039b381674ef176ebd54701a170 XD-3721: Clean Up Compiler/Javadoc Warnings
JIRA: https://jira.spring.io/browse/XD-3731

Various fixes to remove compiler/javadoc warnings from the build.

Tests

New test failures 1
Status Test View job Duration
Collapse Failed FileSourceModuleTests testFileContentsUsingDefaultMode History
Default Job 4 secs
java.lang.AssertionError: java.lang.AssertionError
java.lang.AssertionError
	at org.junit.Assert.fail(Assert.java:86)
	at org.junit.Assert.assertTrue(Assert.java:41)
	at org.junit.Assert.assertTrue(Assert.java:52)
	at org.springframework.xd.dirt.stream.FileSourceModuleTests.testFileContentsUsingDefaultMode(FileSourceModuleTests.java:156)
	at sun.reflect.NativeMethodAccessorImpl.invoke0(Native Method)
	at sun.reflect.NativeMethodAccessorImpl.invoke(NativeMethodAccessorImpl.java:62)
(41 more lines...)

Jira issues

IssueDescriptionStatus
Unknown Issue TypeXD-3721Could not obtain issue details from Jira
Unknown Issue TypeXD-3731Could not obtain issue details from Jira