Windows 2008 x86_64 EC2 build

Build: #355 failed Changes by Gunnar Hillert

Build result summary

Details

Completed
Duration
74 minutes
Labels
None
Agent
(elastic) Elastic Agent on i-4b53ebcb
Revision
8b89c82318a466ee2cf38ae6f945ad435a2fd340 8b89c82318a466ee2cf38ae6f945ad435a2fd340
Total tests
964
Failing since
#353 (Changes by Gary Russell)
Fixed in
#362 (Manual run by Mark Pollack)

Responsible

Code commits

Author Commit Message Commit date
Gunnar Hillert Gunnar Hillert 8b89c82318a466ee2cf38ae6f945ad435a2fd340 8b89c82318a466ee2cf38ae6f945ad435a2fd340 XD-3737 REST - Do not redirect after logout
* Add `HttpStatusReturningLogoutSuccessHandler`
* Remove old `RestLogoutSuccessHandler` as the same functionality is now covered by Spring Security proper

Jira: XD-3737">https://jira.spring.io/browse/XD-3737

Tests

New test failures 1
Status Test View job Duration
Collapse Failed SingleNodeApplicationWithDefaultSecurityTest testSslNotEnabledByDefaultForManagementEndpoints History
Default Job 22 secs
org.springframework.web.client.ResourceAccessException: org.springframework.web.client.ResourceAccessException: I/O error on GET request for "http://localhost:64075/management/metrics": Read timed out; nested exception is java.net.SocketTimeoutException: Read timed out
org.springframework.web.client.ResourceAccessException: I/O error on GET request for "http://localhost:64075/management/metrics": Read timed out; nested exception is java.net.SocketTimeoutException: Read timed out
	at org.springframework.web.client.RestTemplate.doExecute(RestTemplate.java:607)
	at org.springframework.web.client.RestTemplate.execute(RestTemplate.java:557)
	at org.springframework.web.client.RestTemplate.getForEntity(RestTemplate.java:289)
	at org.springframework.xd.dirt.security.SingleNodeApplicationWithDefaultSecurityTest.testSslNotEnabledByDefaultForManagementEndpoints(SingleNodeApplicationWithDefaultSecurityTest.java:95)
	at sun.reflect.NativeMethodAccessorImpl.invoke0(Native Method)
	at sun.reflect.NativeMethodAccessorImpl.invoke(NativeMethodAccessorImpl.java:62)
(60 more lines...)
Fixed tests 1
Status Test Failing since View job Duration
Successful FileSourceModuleTests testFileContentsUsingDefaultMode History
Failing since build #354 (Changes by Gary Russell) Default Job 2 secs

Jira issues

IssueDescriptionStatus
Unknown Issue TypeXD-3737Could not obtain issue details from Jira