Windows 2008 x86_64 EC2 build

Build: #357 failed Changes by Gary Russell

Test results

  • 965 tests in total
  • 1 test failed
  • 82 tests were quarantined / skipped
  • 23 minutes taken in total.
Existing test failures 1
Status Test Failing since View job Duration
org.springframework.web.client.ResourceAccessException: org.springframework.web.client.ResourceAccessException: I/O error on GET request for "http://localhost:64976/management/metrics": Read timed out; nested exception is java.net.SocketTimeoutException: Read timed out
org.springframework.web.client.ResourceAccessException: I/O error on GET request for "http://localhost:64976/management/metrics": Read timed out; nested exception is java.net.SocketTimeoutException: Read timed out
	at org.springframework.web.client.RestTemplate.doExecute(RestTemplate.java:607)
	at org.springframework.web.client.RestTemplate.execute(RestTemplate.java:557)
	at org.springframework.web.client.RestTemplate.getForEntity(RestTemplate.java:289)
	at org.springframework.xd.dirt.security.SingleNodeApplicationWithDefaultSecurityTest.testSslNotEnabledByDefaultForManagementEndpoints(SingleNodeApplicationWithDefaultSecurityTest.java:95)
	at sun.reflect.NativeMethodAccessorImpl.invoke0(Native Method)
	at sun.reflect.NativeMethodAccessorImpl.invoke(NativeMethodAccessorImpl.java:62)
(60 more lines...)
Skipped tests 82
Status Test Failing since View job
Skipped RabbitSingleNodeInitializationTests environmentMatchesTransport History
Default Job
Skipped KafkaMessageBusTests testCustomPartitionCountOverridesDefaultIfLarger History
Default Job
Skipped KafkaMessageBusTests testPartitionedModuleSpEL History
Default Job
Skipped KafkaMessageBusTests testClean History
Default Job
Skipped KafkaMessageBusTests testMoreHeaders History
Default Job
Skipped KafkaMessageBusTests testKafkaSpecificConsumerPropertiesAreSet History
Default Job
Skipped KafkaMessageBusTests testNativeOffsetManagementEnabled History
Default Job
Skipped KafkaMessageBusTests testPartitionedModuleJava History
Default Job
Skipped KafkaMessageBusTests testBadProperties History
Default Job
Skipped KafkaMessageBusTests testNamedChannelPartitionCount History
Default Job
Skipped KafkaMessageBusTests testDirectBinding History
Default Job
Skipped KafkaMessageBusTests testSendAndReceiveNoOriginalContentType History
Default Job
Skipped KafkaMessageBusTests testCustomPartitionCountDoesNotOverridePartitioningIfSmaller History
Default Job
Skipped KafkaMessageBusTests testPartitioningWithSingleReceiver History
Default Job
Skipped KafkaMessageBusTests testCustomPartitionCountOverridesModuleCountAndConcurrencyIfLarger History
Default Job
Skipped KafkaMessageBusTests testCustomPartitionCountOverridesPartitioningIfLarger History
Default Job
Skipped KafkaMessageBusTests testSendAndReceivePubSub History
Default Job
Skipped KafkaMessageBusTests testBadDynamic History
Default Job
Skipped KafkaMessageBusTests testSendAndReceive History
Default Job
Skipped KafkaMessageBusTests testSendAndReceivePubSubWithMultipleConsumers History
Default Job
Skipped KafkaMessageBusTests testCompression History
Default Job
Skipped KafkaMessageBusTests testTopicOffsetManagementEnabled History
Default Job
Skipped KafkaMessageBusTests testCustomPartitionCountDoesNotOverrideModuleCountAndConcurrencyIfSmaller History
Default Job
Skipped KafkaMessageBusTests createInboundPubSubBeforeOutboundPubSub History
Default Job
Skipped KafkaMessageBusTests testKafkaSpecificProducerPropertiesAreSet History
Default Job
Skipped RawModeKafkaMessageBusTests testSendAndReceivePubSub History
Default Job
Skipped RawModeKafkaMessageBusTests createInboundPubSubBeforeOutboundPubSub History
Default Job
Skipped RawModeKafkaMessageBusTests testKafkaSpecificConsumerPropertiesAreSet History
Default Job
Skipped RawModeKafkaMessageBusTests testPartitionedModuleJava History
Default Job
Skipped RawModeKafkaMessageBusTests testMoreHeaders History
Default Job
Skipped RawModeKafkaMessageBusTests testPartitionedModuleSpEL History
Default Job
Skipped RawModeKafkaMessageBusTests testNativeOffsetManagementEnabled History
Default Job
Skipped RawModeKafkaMessageBusTests testCustomPartitionCountOverridesModuleCountAndConcurrencyIfLarger History
Default Job
Skipped RawModeKafkaMessageBusTests testDirectBinding History
Default Job
Skipped RawModeKafkaMessageBusTests testNamedChannelPartitionCount History
Default Job
Skipped RawModeKafkaMessageBusTests testBadProperties History
Default Job
Skipped RawModeKafkaMessageBusTests testBadDynamic History
Default Job
Skipped RawModeKafkaMessageBusTests testTopicOffsetManagementEnabled History
Default Job
Skipped RawModeKafkaMessageBusTests testClean History
Default Job
Skipped RawModeKafkaMessageBusTests testCustomPartitionCountDoesNotOverridePartitioningIfSmaller History
Default Job
Skipped RawModeKafkaMessageBusTests testPartitioningWithSingleReceiver History
Default Job
Skipped RawModeKafkaMessageBusTests testSendAndReceiveNoOriginalContentType History
Default Job
Skipped RawModeKafkaMessageBusTests testSendAndReceivePubSubWithMultipleConsumers History
Default Job
Skipped RawModeKafkaMessageBusTests testCustomPartitionCountOverridesPartitioningIfLarger History
Default Job
Skipped RawModeKafkaMessageBusTests testKafkaSpecificProducerPropertiesAreSet History
Default Job
Skipped RawModeKafkaMessageBusTests testCustomPartitionCountDoesNotOverrideModuleCountAndConcurrencyIfSmaller History
Default Job
Skipped RawModeKafkaMessageBusTests testSendAndReceive History
Default Job
Skipped RawModeKafkaMessageBusTests testCompression History
Default Job
Skipped RawModeKafkaMessageBusTests testCustomPartitionCountOverridesDefaultIfLarger History
Default Job
Skipped RabbitBusCleanerTests testCleanJob History
Default Job
Skipped RabbitBusCleanerTests testCleanStream History
Default Job
Skipped RabbitMessageBusTests testSendAndReceivePubSub History
Default Job
Skipped RabbitMessageBusTests testRequestReplyRequestorProperties History
Default Job
Skipped RabbitMessageBusTests testPartitionedModuleSpEL History
Default Job
Skipped RabbitMessageBusTests testSendAndReceiveBad History
Default Job
Skipped RabbitMessageBusTests testRequestReplyReplierProperties History
Default Job
Skipped RabbitMessageBusTests testBatchingAndCompression History
Default Job
Skipped RabbitMessageBusTests createInboundPubSubBeforeOutboundPubSub History
Default Job
Skipped RabbitMessageBusTests testDirectBinding History
Default Job
Skipped RabbitMessageBusTests testConsumerProperties History
Default Job
Skipped RabbitMessageBusTests testPartitionedModuleJava History
Default Job
Skipped RabbitMessageBusTests testAutoBindDLQ History
Default Job
Skipped RabbitMessageBusTests testSendAndReceiveNoOriginalContentType History
Default Job
Skipped RabbitMessageBusTests testProducerProperties History
Default Job
Skipped RabbitMessageBusTests testPartitioningWithSingleReceiver History
Default Job
Skipped RabbitMessageBusTests testAutoBindDLQwithRepublish History
Default Job
Skipped RabbitMessageBusTests testBadProperties History
Default Job
Skipped RabbitMessageBusTests testSendAndReceive History
Default Job
Skipped RabbitMessageBusTests testAutoBindDLQPartioned History
Default Job
Skipped RabbitMessageBusTests testBadDynamic History
Default Job
Skipped RabbitMessageBusTests testDurablePubSubWithAutoBindDLQ History
Default Job
Skipped RabbitMessageBusTests testClean History
Default Job
Skipped RabbitMessageBusTests testNonDurablePubSubWithAutoBindDLQ History
Default Job
Skipped JobParserTests toDSLTextTransitions History
Default Job
Skipped JobParserTests toDSLTextTransitionsSplit History
Default Job
Skipped JobParserTests toXMLSqoopExample History
Default Job
Skipped RabbitJobPluginTests testThatJobEventsChannelsAreBound History
Default Job
Skipped RabbitJobPluginTests partitionedJob History
Default Job
Skipped RabbitJobPluginTests testThatInputOutputChannelsAreBound History
Default Job
Skipped RabbitJobPluginTests streamNameAdded History
Default Job
Skipped RabbitJobPluginTests streamComponentsAdded History
Default Job
Skipped RabbitJobPluginTests jobOptionsDefaults History
Default Job