Windows 2008 x86_64 EC2 build

Build: #359 failed Changes by Gary Russell

Test results

  • 90 tests in total
  • 1 test failed
  • 1 failure is new
  • 31 tests were quarantined / skipped
  • 13 seconds taken in total.
New test failures 1
Status Test View job Duration
Collapse Failed GaugeHandlerTests testhandlerWithExpression History
Default Job 5 secs
org.springframework.messaging.MessageHandlingException: org.springframework.messaging.MessageHandlingException: nested exception is org.springframework.data.redis.RedisConnectionFailureException: java.net.SocketTimeoutException: Read timed out; nested exception is redis.clients.jedis.exceptions.JedisConnectionException: java.net.SocketTimeoutException: Read timed out
org.springframework.messaging.MessageHandlingException: nested exception is org.springframework.data.redis.RedisConnectionFailureException: java.net.SocketTimeoutException: Read timed out; nested exception is redis.clients.jedis.exceptions.JedisConnectionException: java.net.SocketTimeoutException: Read timed out
	at org.springframework.integration.handler.MethodInvokingMessageProcessor.processMessage(MethodInvokingMessageProcessor.java:96)
	at org.springframework.integration.handler.ServiceActivatingHandler.handleRequestMessage(ServiceActivatingHandler.java:89)
	at org.springframework.integration.handler.AbstractReplyProducingMessageHandler.handleMessageInternal(AbstractReplyProducingMessageHandler.java:99)
	at org.springframework.integration.handler.AbstractMessageHandler.handleMessage(AbstractMessageHandler.java:127)
	at org.springframework.integration.handler.MessageHandlerChain$1.send(MessageHandlerChain.java:123)
	at org.springframework.messaging.core.GenericMessagingTemplate.doSend(GenericMessagingTemplate.java:115)
(115 more lines...)
Skipped tests 31
Status Test Failing since View job
Skipped RichGaugeHandlerTests testhandlerWithExpression History
Default Job
Skipped RichGaugeHandlerTests testhandler History
Default Job
Skipped RichGaugeHandlerTests testParseDouble History
Default Job
Skipped RedisAggregateCounterTests testTwoDaysDataSimulation History
Default Job
Skipped RedisAggregateCounterTests testDayCounts History
Default Job
Skipped RedisAggregateCounterTests testMonthCounts History
Default Job
Skipped RedisAggregateCounterTests test66MinuteCount History
Default Job
Skipped RedisAggregateCounterTests testYearCounts History
Default Job
Skipped RedisCounterRepositoryTests testFindOneNullCounter History
Default Job
Skipped RedisCounterRepositoryTests testCrud History
Default Job
Skipped RedisCounterRepositoryTests testDeleteNullString History
Default Job
Skipped RedisCounterRepositoryTests testDeleteNullCounter History
Default Job
Skipped RedisCounterRepositoryTests findNonExistentRaisesException History
Default Job
Skipped RedisFieldValueCounterRepositoryTests testDeleteNullGauge History
Default Job
Skipped RedisFieldValueCounterRepositoryTests testFindOneNullCounter History
Default Job
Skipped RedisFieldValueCounterRepositoryTests testCrud2 History
Default Job
Skipped RedisFieldValueCounterRepositoryTests testDeleteNullString History
Default Job
Skipped RedisFieldValueCounterRepositoryTests testCrud History
Default Job
Skipped RedisGaugeRepositoryTests testFindOneNullCounter History
Default Job
Skipped RedisGaugeRepositoryTests testDeleteNullGauge History
Default Job
Skipped RedisGaugeRepositoryTests setValueAndResetWorkAsExpected History
Default Job
Skipped RedisGaugeRepositoryTests testDeleteNullString History
Default Job
Skipped RedisGaugeRepositoryTests testCrud History
Default Job
Skipped RedisRichGaugeRepositoryTests resetExistingGaugeCausesReset History
Default Job
Skipped RedisRichGaugeRepositoryTests getOrCreateReturnsCorrectInstance History
Default Job
Skipped RedisRichGaugeRepositoryTests testExponentialMovingAverage History
Default Job
Skipped RedisRichGaugeRepositoryTests testAtomicity History
Default Job
Skipped AbstractRedisRepositoryTests testRangeBoundariesNotPresent History
Default Job
Skipped AbstractRedisRepositoryTests testOutside History
Default Job
Skipped AbstractRedisRepositoryTests testRangeWithBoundariesPresent History
Default Job
Skipped AbstractRedisRepositoryTests testRangeSingleSelection History
Default Job