Windows 2008 x86_64 EC2 build

Build: #361 failed Changes by Gary Russell

Build result summary

Details

Completed
Duration
68 minutes
Labels
None
Agent
(elastic) Elastic Agent on i-6cd3a5ec
Revision
a42ccbcc3c233bc5c784262958e5e0ed001f247f a42ccbcc3c233bc5c784262958e5e0ed001f247f
Total tests
965
Failing since
#353 (Changes by Gary Russell)
Fixed in
#362 (Manual run by Mark Pollack)

Responsible

Code commits

Author Commit Message Commit date
Gary Russell Gary Russell a42ccbcc3c233bc5c784262958e5e0ed001f247f a42ccbcc3c233bc5c784262958e5e0ed001f247f XD-3739: Fix and Configure Script Refresh
JIRA: XD-3739">https://jira.spring.io/browse/XD-3739

Scripts were incorrectly checked for changes with a hard-wired 60ms interval
instead of 60 seconds as stated in the reference manual.

Change the default to 60 seconds and make it configurable; `-1` disables refresh.

Configuration changes

Plan configuration has changed since the last successful build. See the plan audit log for more details.

Tests

New test failures 6
Status Test View job Duration
Collapse Failed RedisMessageBusTests testRetryFail History
Default Job 18 secs
java.lang.AssertionError: java.lang.AssertionError
java.lang.AssertionError
	at org.junit.Assert.fail(Assert.java:86)
	at org.junit.Assert.assertTrue(Assert.java:41)
	at org.junit.Assert.assertNotNull(Assert.java:712)
	at org.junit.Assert.assertNotNull(Assert.java:722)
	at org.springframework.xd.dirt.integration.bus.redis.RedisMessageBusTests.testRetryFail(RedisMessageBusTests.java:335)
	at sun.reflect.NativeMethodAccessorImpl.invoke0(Native Method)
(43 more lines...)
Collapse Failed RedisMessageBusTests testSendAndReceivePubSub History
Default Job 7 secs
java.lang.AssertionError: java.lang.AssertionError
java.lang.AssertionError
	at org.junit.Assert.fail(Assert.java:86)
	at org.junit.Assert.assertTrue(Assert.java:41)
	at org.junit.Assert.assertNotNull(Assert.java:712)
	at org.junit.Assert.assertNotNull(Assert.java:722)
	at org.springframework.xd.dirt.integration.bus.AbstractMessageBusTests.testSendAndReceivePubSub(AbstractMessageBusTests.java:146)
	at org.springframework.xd.dirt.integration.bus.redis.RedisMessageBusTests.testSendAndReceivePubSub(RedisMessageBusTests.java:89)
(44 more lines...)
Collapse Failed RedisMessageBusTests createInboundPubSubBeforeOutboundPubSub History
Default Job 32 secs
java.lang.AssertionError: java.lang.AssertionError: Failed to receive tap after retry
java.lang.AssertionError: Failed to receive tap after retry
	at org.junit.Assert.fail(Assert.java:88)
	at org.junit.Assert.assertTrue(Assert.java:41)
	at org.junit.Assert.assertFalse(Assert.java:64)
	at org.springframework.xd.dirt.integration.bus.AbstractMessageBusTests.createInboundPubSubBeforeOutboundPubSub(AbstractMessageBusTests.java:225)
	at sun.reflect.NativeMethodAccessorImpl.invoke0(Native Method)
	at sun.reflect.NativeMethodAccessorImpl.invoke(NativeMethodAccessorImpl.java:62)
(42 more lines...)
Collapse Failed RedisPublishingMessageHandlerTests testWithDefaultSerializer History
Default Job 4 secs
java.lang.AssertionError: java.lang.AssertionError: expected:<0> but was:<10>
java.lang.AssertionError: expected:<0> but was:<10>
	at org.junit.Assert.fail(Assert.java:88)
	at org.junit.Assert.failNotEquals(Assert.java:834)
	at org.junit.Assert.assertEquals(Assert.java:645)
	at org.junit.Assert.assertEquals(Assert.java:631)
	at org.springframework.xd.dirt.integration.redis.RedisPublishingMessageHandlerTests.testWithDefaultSerializer(RedisPublishingMessageHandlerTests.java:81)
	at sun.reflect.NativeMethodAccessorImpl.invoke0(Native Method)
(42 more lines...)
Collapse Failed RedisQueueInboundChannelAdapterTests testDefaultMsgSerializer History
Default Job 1 sec
java.lang.NullPointerException: java.lang.NullPointerException
java.lang.NullPointerException
	at org.springframework.xd.dirt.integration.redis.RedisQueueInboundChannelAdapterTests.testDefaultMsgSerializer(RedisQueueInboundChannelAdapterTests.java:124)
	at sun.reflect.NativeMethodAccessorImpl.invoke0(Native Method)
	at sun.reflect.NativeMethodAccessorImpl.invoke(NativeMethodAccessorImpl.java:62)
	at sun.reflect.DelegatingMethodAccessorImpl.invoke(DelegatingMethodAccessorImpl.java:43)
	at java.lang.reflect.Method.invoke(Method.java:483)
	at org.junit.runners.model.FrameworkMethod$1.runReflectiveCall(FrameworkMethod.java:50)
(39 more lines...)
Collapse Failed RedisQueueInboundChannelAdapterTests testDefaultPayloadSerializer History
Default Job 1 sec
java.lang.AssertionError: java.lang.AssertionError
java.lang.AssertionError
	at org.junit.Assert.fail(Assert.java:86)
	at org.junit.Assert.assertTrue(Assert.java:41)
	at org.junit.Assert.assertNotNull(Assert.java:712)
	at org.junit.Assert.assertNotNull(Assert.java:722)
	at org.springframework.xd.dirt.integration.redis.RedisQueueInboundChannelAdapterTests.testDefaultPayloadSerializer(RedisQueueInboundChannelAdapterTests.java:103)
	at sun.reflect.NativeMethodAccessorImpl.invoke0(Native Method)
(43 more lines...)
Fixed tests 1
Status Test Failing since View job Duration
Successful GaugeHandlerTests testhandlerWithExpression History
Failing since build #359 (Changes by Gary Russell) Default Job < 1 sec

Jira issues

IssueDescriptionStatus
Unknown Issue TypeXD-3739Could not obtain issue details from Jira