Windows 2008 x86_64 EC2 build

Build: #364 failed Changes by Gary Russell

Build result summary

Details

Completed
Duration
64 minutes
Labels
None
Agent
(elastic) Elastic Agent on i-818fd701
Revision
8606f286463760c8fa0fbacd0e4593e7cc14d852 8606f286463760c8fa0fbacd0e4593e7cc14d852
Total tests
966
Fixed in
#365 (Changes by Gary Russell)

Tests

Responsible

Code commits

Author Commit Message Commit date
Gary Russell Gary Russell 8606f286463760c8fa0fbacd0e4593e7cc14d852 8606f286463760c8fa0fbacd0e4593e7cc14d852 Fix Typo in Reference
s/rabbit/redis/ in redis bus properties configuration.

Tests

New test failures 1
Status Test View job Duration
Collapse Failed FileSourceModuleTests testFileContentsUsingDefaultMode History
Default Job 5 secs
java.lang.AssertionError: java.lang.AssertionError
java.lang.AssertionError
	at org.junit.Assert.fail(Assert.java:86)
	at org.junit.Assert.assertTrue(Assert.java:41)
	at org.junit.Assert.assertTrue(Assert.java:52)
	at org.springframework.xd.dirt.stream.FileSourceModuleTests.testFileContentsUsingDefaultMode(FileSourceModuleTests.java:156)
	at sun.reflect.NativeMethodAccessorImpl.invoke0(Native Method)
	at sun.reflect.NativeMethodAccessorImpl.invoke(NativeMethodAccessorImpl.java:62)
(41 more lines...)