Windows 2008 x86_64 EC2 build

Build result summary

Details

Completed
Duration
62 minutes
Labels
None
Agent
(elastic) Elastic Agent on i-efe1f56f
Revision
ae0c67362ee3fd80974fe3fb4820cd89f53fc769 ae0c67362ee3fd80974fe3fb4820cd89f53fc769
Total tests
1405
Fixed in
#374 (Changes by Marius Bogoevici <mbogoevici@pivotal.io>)

Tests

Responsible

  • mbg_at_pivotal mbg_at_pivotal Automatically assigned

Code commits

Author Commit Message Commit date
Marius Bogoevici <mbogoevici@pivotal.io> Marius Bogoevici <mbogoevici@pivotal.io> ae0c67362ee3fd80974fe3fb4820cd89f53fc769 ae0c67362ee3fd80974fe3fb4820cd89f53fc769 XD-3718 Pass validation for partitioning props on named destionations with Kafka

Tests

New test failures 1
Status Test View job Duration
Collapse Failed JdbcModulesWithSecurityTests testJdbcSourceNoUpdateStatement History
Default Job 9 secs
java.lang.AssertionError: java.lang.AssertionError: 
Expected: "2", trying at most 20 times
     but: failed after 20*100=2000ms:
was "8", was "10", was "10", was "10", was "10", was "10", was "10", was "10", was "10", was "12", was "12", was "12", was "12", was "12", was "12", was "12", was "12", was "14", was "14", was "14", 
java.lang.AssertionError: 
Expected: "2", trying at most 20 times
     but: failed after 20*100=2000ms:
was "8", was "10", was "10", was "10", was "10", was "10", was "10", was "10", was "10", was "12", was "12", was "12", was "12", was "12", was "12", was "12", was "12", was "14", was "14", was "14", 
(65 more lines...)

Jira issues

IssueDescriptionStatus
Unknown Issue TypeXD-3718Could not obtain issue details from Jira