Windows 2008 x86_64 EC2 build

Build: #377 failed Changes by Gary Russell

Build result summary

Details

Completed
Duration
33 minutes
Labels
None
Agent
(elastic) Elastic Agent on i-5d9b58de
Revision
115487070e9196a4bb8bfd9b6fe8b85494ac6cca 115487070e9196a4bb8bfd9b6fe8b85494ac6cca
Total tests
968
Failing since
#376 (Changes by Spring Buildmaster)
Fixed in
#380 (Changes by Janne Valkealahti)

Tests

Responsible

Code commits

Author Commit Message Commit date
Gary Russell Gary Russell 115487070e9196a4bb8bfd9b6fe8b85494ac6cca 115487070e9196a4bb8bfd9b6fe8b85494ac6cca XD-3748: Fix ModuleObjectNamingStrategy
JIRA: XD-3748">https://jira.spring.io/browse/XD-3748

Previously, the `ModuleObjectNamingStrategy` didn't handle beans with
a `beanKey` that's a simple bean name, such as the `MessageHistoryConfigurer`.

Subclass `MetadataNamingStrategy` which handles simple bean names.

Add tests.

Tests

New test failures 3
Status Test View job Duration
Collapse Failed ExampleProcessingChainTests testProcessingChain History
Default Job 2 secs
java.lang.ClassCastException: java.lang.ClassCastException: org.joda.time.DateTime cannot be cast to java.lang.String
java.lang.ClassCastException: org.joda.time.DateTime cannot be cast to java.lang.String
	at org.springframework.xd.dirt.stream.ExampleProcessingChainTests.testProcessingChain(ExampleProcessingChainTests.java:81)
	at sun.reflect.NativeMethodAccessorImpl.invoke0(Native Method)
	at sun.reflect.NativeMethodAccessorImpl.invoke(NativeMethodAccessorImpl.java:62)
	at sun.reflect.DelegatingMethodAccessorImpl.invoke(DelegatingMethodAccessorImpl.java:43)
	at java.lang.reflect.Method.invoke(Method.java:483)
	at org.junit.runners.model.FrameworkMethod$1.runReflectiveCall(FrameworkMethod.java:50)
(37 more lines...)
Collapse Failed ExampleProcessingChainTests processingChain History
Default Job 6 secs
java.lang.AssertionError: java.lang.AssertionError: expected:<HELLO> but was:<null>
java.lang.AssertionError: expected:<HELLO> but was:<null>
	at org.junit.Assert.fail(Assert.java:88)
	at org.junit.Assert.failNotEquals(Assert.java:834)
	at org.junit.Assert.assertEquals(Assert.java:118)
	at org.junit.Assert.assertEquals(Assert.java:144)
	at org.springframework.xd.dirt.stream.ExampleProcessingChainTests.processingChain(ExampleProcessingChainTests.java:106)
	at sun.reflect.NativeMethodAccessorImpl.invoke0(Native Method)
(41 more lines...)
Collapse Failed ExampleProcessingChainTests chainWithSink History
Default Job 8 secs
java.lang.AssertionError: java.lang.AssertionError
java.lang.AssertionError
	at org.junit.Assert.fail(Assert.java:86)
	at org.junit.Assert.assertTrue(Assert.java:41)
	at org.junit.Assert.assertNotNull(Assert.java:712)
	at org.junit.Assert.assertNotNull(Assert.java:722)
	at org.springframework.xd.dirt.stream.ExampleProcessingChainTests.chainWithSink(ExampleProcessingChainTests.java:148)
	at sun.reflect.NativeMethodAccessorImpl.invoke0(Native Method)
(41 more lines...)

Jira issues

IssueDescriptionStatus
Unknown Issue TypeXD-3748Could not obtain issue details from Jira