Windows 2008 x86_64 EC2 build

Build: #378 failed Changes by Gary Russell

Build result summary

Details

Completed
Duration
116 minutes
Labels
None
Agent
(elastic) Elastic Agent on i-1946238a
Revision
81e94eaa019e5b7a0d224b956470a6c34cf4a7f1 81e94eaa019e5b7a0d224b956470a6c34cf4a7f1
Total tests
968
Failing since
#376 (Changes by Spring Buildmaster)
Fixed in
#380 (Changes by Janne Valkealahti)

Responsible

Code commits

Author Commit Message Commit date
Gary Russell Gary Russell 81e94eaa019e5b7a0d224b956470a6c34cf4a7f1 81e94eaa019e5b7a0d224b956470a6c34cf4a7f1 XD-3747: Add RabbitMQ channelCacheSize Property
JIRA: XD-3747">https://jira.spring.io/browse/XD-3747

Add channelCacheSize to RabbitMQ Sink

Tests

New test failures 1
Status Test View job Duration
Collapse Failed ModuleOptionsDefaultsOrderingTests testModuleDefaultsCome5th History
Default Job 7 mins
java.lang.AssertionError: java.lang.AssertionError: expected:<ping> but was:<null>
java.lang.AssertionError: expected:<ping> but was:<null>
	at org.junit.Assert.fail(Assert.java:88)
	at org.junit.Assert.failNotEquals(Assert.java:834)
	at org.junit.Assert.assertEquals(Assert.java:118)
	at org.junit.Assert.assertEquals(Assert.java:144)
	at org.springframework.xd.dirt.stream.ModuleOptionsDefaultsOrderingTests.runTestAndExpect(ModuleOptionsDefaultsOrderingTests.java:158)
	at org.springframework.xd.dirt.stream.ModuleOptionsDefaultsOrderingTests.testModuleDefaultsCome5th(ModuleOptionsDefaultsOrderingTests.java:105)
(44 more lines...)
Existing test failures 3
Status Test Failing since View job Duration
java.lang.ClassCastException: java.lang.ClassCastException: org.joda.time.DateTime cannot be cast to java.lang.String
java.lang.ClassCastException: org.joda.time.DateTime cannot be cast to java.lang.String
	at org.springframework.xd.dirt.stream.ExampleProcessingChainTests.testProcessingChain(ExampleProcessingChainTests.java:81)
	at sun.reflect.NativeMethodAccessorImpl.invoke0(Native Method)
	at sun.reflect.NativeMethodAccessorImpl.invoke(NativeMethodAccessorImpl.java:62)
	at sun.reflect.DelegatingMethodAccessorImpl.invoke(DelegatingMethodAccessorImpl.java:43)
	at java.lang.reflect.Method.invoke(Method.java:483)
	at org.junit.runners.model.FrameworkMethod$1.runReflectiveCall(FrameworkMethod.java:50)
(37 more lines...)
java.lang.AssertionError: java.lang.AssertionError: expected:<HELLO> but was:<null>
java.lang.AssertionError: expected:<HELLO> but was:<null>
	at org.junit.Assert.fail(Assert.java:88)
	at org.junit.Assert.failNotEquals(Assert.java:834)
	at org.junit.Assert.assertEquals(Assert.java:118)
	at org.junit.Assert.assertEquals(Assert.java:144)
	at org.springframework.xd.dirt.stream.ExampleProcessingChainTests.processingChain(ExampleProcessingChainTests.java:106)
	at sun.reflect.NativeMethodAccessorImpl.invoke0(Native Method)
(41 more lines...)
java.lang.AssertionError: java.lang.AssertionError
java.lang.AssertionError
	at org.junit.Assert.fail(Assert.java:86)
	at org.junit.Assert.assertTrue(Assert.java:41)
	at org.junit.Assert.assertNotNull(Assert.java:712)
	at org.junit.Assert.assertNotNull(Assert.java:722)
	at org.springframework.xd.dirt.stream.ExampleProcessingChainTests.chainWithSink(ExampleProcessingChainTests.java:148)
	at sun.reflect.NativeMethodAccessorImpl.invoke0(Native Method)
(41 more lines...)

Jira issues

IssueDescriptionStatus
Unknown Issue TypeXD-3747Could not obtain issue details from Jira