Windows 2008 x86_64 EC2 build

Build: #14 failed

Job: Default Job failed

Stages & jobs

  1. Default Stage

Job result summary

Completed
Duration
23 minutes
Agent
(elastic) Elastic Agent on i-5aaccbb5
Revision
cfab4ea67d4a9be45021f0abfa316aea359bc810 cfab4ea67d4a9be45021f0abfa316aea359bc810
Total tests
649
Fixed in
#202 (Manual run by David Turanski)
Number of retries
1

Tests

  • 649 tests in total
  • 7 tests failed
  • 7 failures are new
  • 8 minutes taken in total.
New test failures 7
Status Test Duration
Collapse Failed RabbitSingleNodeInitializationTests classMethod History
< 1 sec
java.lang.AssertionError: java.lang.AssertionError: RABBIT IS NOT AVAILABLE
java.lang.AssertionError: RABBIT IS NOT AVAILABLE
	at org.junit.Assert.fail(Assert.java:88)
	at org.springframework.xd.test.AbstractExternalResourceTestSupport.failOrSkip(AbstractExternalResourceTestSupport.java:90)
	at org.springframework.xd.test.AbstractExternalResourceTestSupport.apply(AbstractExternalResourceTestSupport.java:63)
	at org.junit.rules.RunRules.applyAll(RunRules.java:26)
	at org.junit.rules.RunRules.<init>(RunRules.java:15)
	at org.junit.runners.BlockJUnit4ClassRunner.withTestRules(BlockJUnit4ClassRunner.java:400)
(35 more lines...)
Collapse Failed KafkaMessageBusTests classMethod History
< 1 sec
java.lang.AssertionError: java.lang.AssertionError: KAFKA IS NOT AVAILABLE
java.lang.AssertionError: KAFKA IS NOT AVAILABLE
	at org.junit.Assert.fail(Assert.java:88)
	at org.springframework.xd.test.AbstractExternalResourceTestSupport.failOrSkip(AbstractExternalResourceTestSupport.java:90)
	at org.springframework.xd.test.AbstractExternalResourceTestSupport.apply(AbstractExternalResourceTestSupport.java:63)
	at org.junit.rules.RunRules.applyAll(RunRules.java:26)
	at org.junit.rules.RunRules.<init>(RunRules.java:15)
	at org.junit.runners.BlockJUnit4ClassRunner.withTestRules(BlockJUnit4ClassRunner.java:400)
(35 more lines...)
Collapse Failed RabbitBusCleanerTests classMethod History
< 1 sec
java.lang.AssertionError: java.lang.AssertionError: RABBITADMIN IS NOT AVAILABLE
java.lang.AssertionError: RABBITADMIN IS NOT AVAILABLE
	at org.junit.Assert.fail(Assert.java:88)
	at org.springframework.xd.test.AbstractExternalResourceTestSupport.failOrSkip(AbstractExternalResourceTestSupport.java:90)
	at org.springframework.xd.test.AbstractExternalResourceTestSupport.apply(AbstractExternalResourceTestSupport.java:63)
	at org.junit.rules.RunRules.applyAll(RunRules.java:26)
	at org.junit.rules.RunRules.<init>(RunRules.java:15)
	at org.junit.runners.BlockJUnit4ClassRunner.withTestRules(BlockJUnit4ClassRunner.java:400)
(35 more lines...)
Collapse Failed RabbitMessageBusTests classMethod History
< 1 sec
java.lang.AssertionError: java.lang.AssertionError: RABBIT IS NOT AVAILABLE
java.lang.AssertionError: RABBIT IS NOT AVAILABLE
	at org.junit.Assert.fail(Assert.java:88)
	at org.springframework.xd.test.AbstractExternalResourceTestSupport.failOrSkip(AbstractExternalResourceTestSupport.java:90)
	at org.springframework.xd.test.AbstractExternalResourceTestSupport.apply(AbstractExternalResourceTestSupport.java:63)
	at org.junit.rules.RunRules.applyAll(RunRules.java:26)
	at org.junit.rules.RunRules.<init>(RunRules.java:15)
	at org.junit.runners.BlockJUnit4ClassRunner.withTestRules(BlockJUnit4ClassRunner.java:400)
(33 more lines...)
Collapse Failed RabbitJobPluginTests classMethod History
< 1 sec
java.lang.AssertionError: java.lang.AssertionError: RABBIT IS NOT AVAILABLE
java.lang.AssertionError: RABBIT IS NOT AVAILABLE
	at org.junit.Assert.fail(Assert.java:88)
	at org.springframework.xd.test.AbstractExternalResourceTestSupport.failOrSkip(AbstractExternalResourceTestSupport.java:90)
	at org.springframework.xd.test.AbstractExternalResourceTestSupport.apply(AbstractExternalResourceTestSupport.java:63)
	at org.junit.rules.RunRules.applyAll(RunRules.java:26)
	at org.junit.rules.RunRules.<init>(RunRules.java:15)
	at org.junit.runners.BlockJUnit4ClassRunner.withTestRules(BlockJUnit4ClassRunner.java:400)
(36 more lines...)
Collapse Failed KafkaSingleNodeStreamDeploymentIntegrationTests classMethod History
< 1 sec
java.lang.AssertionError: java.lang.AssertionError: KAFKA IS NOT AVAILABLE
java.lang.AssertionError: KAFKA IS NOT AVAILABLE
	at org.junit.Assert.fail(Assert.java:88)
	at org.springframework.xd.test.AbstractExternalResourceTestSupport.failOrSkip(AbstractExternalResourceTestSupport.java:90)
	at org.springframework.xd.test.AbstractExternalResourceTestSupport.apply(AbstractExternalResourceTestSupport.java:63)
	at org.junit.rules.RunRules.applyAll(RunRules.java:26)
	at org.junit.rules.RunRules.<init>(RunRules.java:15)
	at org.junit.runners.ParentRunner.withClassRules(ParentRunner.java:245)
(25 more lines...)
Collapse Failed RabbitSingleNodeStreamDeploymentIntegrationTests classMethod History
< 1 sec
java.lang.AssertionError: java.lang.AssertionError: MQTT IS NOT AVAILABLE
java.lang.AssertionError: MQTT IS NOT AVAILABLE
	at org.junit.Assert.fail(Assert.java:88)
	at org.springframework.xd.test.AbstractExternalResourceTestSupport.failOrSkip(AbstractExternalResourceTestSupport.java:90)
	at org.springframework.xd.test.AbstractExternalResourceTestSupport.apply(AbstractExternalResourceTestSupport.java:63)
	at org.junit.rules.RunRules.applyAll(RunRules.java:26)
	at org.junit.rules.RunRules.<init>(RunRules.java:15)
	at org.junit.runners.ParentRunner.withClassRules(ParentRunner.java:245)
(25 more lines...)