Windows 2008 x86_64 EC2 build

Build: #156 failed

Job: Default Job failed

Stages & jobs

  1. Default Stage

Job result summary

Completed
Duration
57 minutes
Agent
(elastic) Elastic Agent on i-57153881
Revision
efa33e9ff493782f9fb2737659d6c5f2811059ec efa33e9ff493782f9fb2737659d6c5f2811059ec
Total tests
1055
Failing since
#14 (Rebuilt by Trevor Marshall)
Fixed in
#202 (Manual run by David Turanski)

Tests

  • 1,055 tests in total
  • 5 tests failed
  • 4 failures are new
  • 63 tests were quarantined / skipped
  • 31 minutes taken in total.
New test failures 4
Status Test Duration
Collapse Failed FtpModulesTests testModeOptionEqualsContents History
36 secs
java.lang.AssertionError: java.lang.AssertionError
java.lang.AssertionError
	at org.junit.Assert.fail(Assert.java:86)
	at org.junit.Assert.assertTrue(Assert.java:41)
	at org.junit.Assert.assertTrue(Assert.java:52)
	at org.springframework.xd.shell.command.StreamCommandTemplate.verifyExists(StreamCommandTemplate.java:162)
	at org.springframework.xd.shell.command.StreamCommandTemplate.doCreate(StreamCommandTemplate.java:99)
	at org.springframework.xd.shell.command.StreamCommandTemplate.create(StreamCommandTemplate.java:65)
(62 more lines...)
Collapse Failed FtpModulesTests testModeOptionEqualsDefaultContents History
36 secs
java.lang.AssertionError: java.lang.AssertionError
java.lang.AssertionError
	at org.junit.Assert.fail(Assert.java:86)
	at org.junit.Assert.assertTrue(Assert.java:41)
	at org.junit.Assert.assertTrue(Assert.java:52)
	at org.springframework.xd.shell.command.StreamCommandTemplate.verifyExists(StreamCommandTemplate.java:162)
	at org.springframework.xd.shell.command.StreamCommandTemplate.doCreate(StreamCommandTemplate.java:99)
	at org.springframework.xd.shell.command.StreamCommandTemplate.create(StreamCommandTemplate.java:65)
(62 more lines...)
Collapse Failed FtpModulesTests testModeOptionEqualsLines History
36 secs
java.lang.AssertionError: java.lang.AssertionError
java.lang.AssertionError
	at org.junit.Assert.fail(Assert.java:86)
	at org.junit.Assert.assertTrue(Assert.java:41)
	at org.junit.Assert.assertTrue(Assert.java:52)
	at org.springframework.xd.shell.command.StreamCommandTemplate.verifyExists(StreamCommandTemplate.java:162)
	at org.springframework.xd.shell.command.StreamCommandTemplate.doCreate(StreamCommandTemplate.java:99)
	at org.springframework.xd.shell.command.StreamCommandTemplate.create(StreamCommandTemplate.java:65)
(62 more lines...)
Collapse Failed FtpModulesTests testModeOptionEqualsRef History
36 secs
java.lang.AssertionError: java.lang.AssertionError
java.lang.AssertionError
	at org.junit.Assert.fail(Assert.java:86)
	at org.junit.Assert.assertTrue(Assert.java:41)
	at org.junit.Assert.assertTrue(Assert.java:52)
	at org.springframework.xd.shell.command.StreamCommandTemplate.verifyExists(StreamCommandTemplate.java:162)
	at org.springframework.xd.shell.command.StreamCommandTemplate.doCreate(StreamCommandTemplate.java:99)
	at org.springframework.xd.shell.command.StreamCommandTemplate.create(StreamCommandTemplate.java:65)
(62 more lines...)
Existing test failures 1
Status Test Failing since Duration
java.lang.AssertionError: java.lang.AssertionError
java.lang.AssertionError
	at org.junit.Assert.fail(Assert.java:86)
	at org.junit.Assert.assertTrue(Assert.java:41)
	at org.junit.Assert.assertTrue(Assert.java:52)
	at org.springframework.xd.shell.command.StreamCommandTemplate.verifyExists(StreamCommandTemplate.java:162)
	at org.springframework.xd.shell.command.StreamCommandTemplate.doCreate(StreamCommandTemplate.java:99)
	at org.springframework.xd.shell.command.StreamCommandTemplate.create(StreamCommandTemplate.java:65)
(62 more lines...)