Windows 2008 x86_64 EC2 build

Build: #185 failed

Job: Default Job failed

Stages & jobs

  1. Default Stage

Job result summary

Completed
Duration
37 minutes
Agent
(elastic) Elastic Agent on i-c2bb536b
Revision
82fe3fc82b7e1cc615c61290cbc8ecba2fe64b8a 82fe3fc82b7e1cc615c61290cbc8ecba2fe64b8a
Total tests
1071
Failing since
#14 (Rebuilt by Trevor Marshall)
Fixed in
#202 (Manual run by David Turanski)

Tests

  • 1,071 tests in total
  • 6 tests failed
  • 77 tests were quarantined / skipped
  • 24 minutes taken in total.
Existing test failures 6
Status Test Failing since Duration
java.lang.AssertionError: java.lang.AssertionError
java.lang.AssertionError
	at org.junit.Assert.fail(Assert.java:86)
	at org.junit.Assert.assertTrue(Assert.java:41)
	at org.junit.Assert.assertTrue(Assert.java:52)
	at org.springframework.xd.shell.command.StreamCommandTemplate.verifyExists(StreamCommandTemplate.java:162)
	at org.springframework.xd.shell.command.StreamCommandTemplate.doCreate(StreamCommandTemplate.java:99)
	at org.springframework.xd.shell.command.StreamCommandTemplate.create(StreamCommandTemplate.java:65)
(62 more lines...)
java.lang.AssertionError: java.lang.AssertionError
java.lang.AssertionError
	at org.junit.Assert.fail(Assert.java:86)
	at org.junit.Assert.assertTrue(Assert.java:41)
	at org.junit.Assert.assertTrue(Assert.java:52)
	at org.springframework.xd.shell.command.StreamCommandTemplate.verifyExists(StreamCommandTemplate.java:162)
	at org.springframework.xd.shell.command.StreamCommandTemplate.doCreate(StreamCommandTemplate.java:99)
	at org.springframework.xd.shell.command.StreamCommandTemplate.create(StreamCommandTemplate.java:65)
(62 more lines...)
java.lang.AssertionError: java.lang.AssertionError
java.lang.AssertionError
	at org.junit.Assert.fail(Assert.java:86)
	at org.junit.Assert.assertTrue(Assert.java:41)
	at org.junit.Assert.assertTrue(Assert.java:52)
	at org.springframework.xd.shell.command.StreamCommandTemplate.verifyExists(StreamCommandTemplate.java:162)
	at org.springframework.xd.shell.command.StreamCommandTemplate.doCreate(StreamCommandTemplate.java:99)
	at org.springframework.xd.shell.command.StreamCommandTemplate.create(StreamCommandTemplate.java:65)
(62 more lines...)
java.lang.AssertionError: java.lang.AssertionError
java.lang.AssertionError
	at org.junit.Assert.fail(Assert.java:86)
	at org.junit.Assert.assertTrue(Assert.java:41)
	at org.junit.Assert.assertTrue(Assert.java:52)
	at org.springframework.xd.shell.command.StreamCommandTemplate.verifyExists(StreamCommandTemplate.java:162)
	at org.springframework.xd.shell.command.StreamCommandTemplate.doCreate(StreamCommandTemplate.java:99)
	at org.springframework.xd.shell.command.StreamCommandTemplate.create(StreamCommandTemplate.java:65)
(62 more lines...)
java.lang.AssertionError: java.lang.AssertionError
java.lang.AssertionError
	at org.junit.Assert.fail(Assert.java:86)
	at org.junit.Assert.assertTrue(Assert.java:41)
	at org.junit.Assert.assertTrue(Assert.java:52)
	at org.springframework.xd.shell.command.StreamCommandTemplate.verifyExists(StreamCommandTemplate.java:162)
	at org.springframework.xd.shell.command.StreamCommandTemplate.doCreate(StreamCommandTemplate.java:99)
	at org.springframework.xd.shell.command.StreamCommandTemplate.create(StreamCommandTemplate.java:65)
(62 more lines...)
java.lang.AssertionError: java.lang.AssertionError
java.lang.AssertionError
	at org.junit.Assert.fail(Assert.java:86)
	at org.junit.Assert.assertTrue(Assert.java:41)
	at org.junit.Assert.assertTrue(Assert.java:52)
	at org.springframework.xd.shell.command.StreamCommandTemplate.verifyExists(StreamCommandTemplate.java:162)
	at org.springframework.xd.shell.command.StreamCommandTemplate.doCreate(StreamCommandTemplate.java:99)
	at org.springframework.xd.shell.command.StreamCommandTemplate.create(StreamCommandTemplate.java:65)
(62 more lines...)