Windows 2008 x86_64 EC2 build

Build: #215 failed

Job: Default Job failed

Stages & jobs

  1. Default Stage

Job result summary

Completed
Duration
43 minutes
Agent
(elastic) Elastic Agent on i-eabf1143
Revision
0ff333f2ab087114192686d677df0fae006b6f8c 0ff333f2ab087114192686d677df0fae006b6f8c
Total tests
1097
Fixed in
#216 (Code changes detected)

Tests

  • 1,097 tests in total
  • 1 test failed
  • 1 failure is new
  • 77 tests were quarantined / skipped
  • 29 minutes taken in total.
New test failures 1
Status Test Duration
Collapse Failed LocalTransportSparkStreamingTests testTapSparkProcessor History
19 secs
java.lang.AssertionError: java.lang.AssertionError: 
Expected: an existing metric, trying at most 20 times
     but: failed after 20*100=2000ms:

java.lang.AssertionError: 
Expected: an existing metric, trying at most 20 times
     but: failed after 20*100=2000ms:

(50 more lines...)