Windows 2008 x86_64 EC2 build

Build: #264 failed

Job: Default Job failed

Stages & jobs

  1. Default Stage

Test results

  • 700 tests in total
  • 2 tests failed
  • 2 failures are new
  • 7 tests were quarantined / skipped
  • 16 minutes taken in total.

Build 264 has the following 2 errors: 2 new failure(s) occurred since the previous build.

New test failures 2
Status Test Duration
Collapse Failed ExampleProcessingChainTests processingChain History
7 secs
java.lang.AssertionError: java.lang.AssertionError: expected:<HELLO> but was:<null>
java.lang.AssertionError: expected:<HELLO> but was:<null>
	at org.junit.Assert.fail(Assert.java:88)
	at org.junit.Assert.failNotEquals(Assert.java:834)
	at org.junit.Assert.assertEquals(Assert.java:118)
	at org.junit.Assert.assertEquals(Assert.java:144)
	at org.springframework.xd.dirt.stream.ExampleProcessingChainTests.processingChain(ExampleProcessingChainTests.java:106)
	at sun.reflect.NativeMethodAccessorImpl.invoke0(Native Method)
(41 more lines...)
Collapse Failed ExampleProcessingChainTests testProcessingChain History
6 secs
java.lang.ClassCastException: java.lang.ClassCastException: org.joda.time.DateTime cannot be cast to java.lang.String
java.lang.ClassCastException: org.joda.time.DateTime cannot be cast to java.lang.String
	at org.springframework.xd.dirt.stream.ExampleProcessingChainTests.testProcessingChain(ExampleProcessingChainTests.java:81)
	at sun.reflect.NativeMethodAccessorImpl.invoke0(Native Method)
	at sun.reflect.NativeMethodAccessorImpl.invoke(NativeMethodAccessorImpl.java:62)
	at sun.reflect.DelegatingMethodAccessorImpl.invoke(DelegatingMethodAccessorImpl.java:43)
	at java.lang.reflect.Method.invoke(Method.java:483)
	at org.junit.runners.model.FrameworkMethod$1.runReflectiveCall(FrameworkMethod.java:50)
(37 more lines...)