Windows 2008 x86_64 EC2 build

Build: #269 failed

Job: Default Job failed

Stages & jobs

  1. Default Stage

Job result summary

Completed
Duration
35 minutes
Agent
(elastic) Elastic Agent on i-a8939600
Revision
91d0d0ce2cc5741bd8223c23cf7ae5b6d17f25b6 91d0d0ce2cc5741bd8223c23cf7ae5b6d17f25b6
Total tests
701
Fixed in
#271 (Code changes detected)

Tests

  • 701 tests in total
  • 2 tests failed
  • 2 failures are new
  • 7 tests were quarantined / skipped
  • 17 minutes taken in total.
New test failures 2
Status Test Duration
Collapse Failed RedisQueueInboundChannelAdapterTests testCustomPayloadSerializer History
1 sec
java.lang.NullPointerException: java.lang.NullPointerException
java.lang.NullPointerException
	at org.springframework.xd.dirt.integration.redis.RedisQueueInboundChannelAdapterTests.testCustomPayloadSerializer(RedisQueueInboundChannelAdapterTests.java:175)
	at sun.reflect.NativeMethodAccessorImpl.invoke0(Native Method)
	at sun.reflect.NativeMethodAccessorImpl.invoke(NativeMethodAccessorImpl.java:62)
	at sun.reflect.DelegatingMethodAccessorImpl.invoke(DelegatingMethodAccessorImpl.java:43)
	at java.lang.reflect.Method.invoke(Method.java:483)
	at org.junit.runners.model.FrameworkMethod$1.runReflectiveCall(FrameworkMethod.java:50)
(41 more lines...)
Collapse Failed FileSourceModuleTests testFileContentsUsingDefaultMode History
3 secs
java.lang.AssertionError: java.lang.AssertionError
java.lang.AssertionError
	at org.junit.Assert.fail(Assert.java:86)
	at org.junit.Assert.assertTrue(Assert.java:41)
	at org.junit.Assert.assertTrue(Assert.java:52)
	at org.springframework.xd.dirt.stream.FileSourceModuleTests.testFileContentsUsingDefaultMode(FileSourceModuleTests.java:154)
	at sun.reflect.NativeMethodAccessorImpl.invoke0(Native Method)
	at sun.reflect.NativeMethodAccessorImpl.invoke(NativeMethodAccessorImpl.java:62)
(41 more lines...)