Windows 2008 x86_64 EC2 build

Build: #270 failed

Job: Default Job failed

Stages & jobs

  1. Default Stage

Job result summary

Completed
Duration
41 minutes
Agent
(elastic) Elastic Agent on i-c2be4b69
Revision
3fa82c09f4614412b7f5a7e917a42c8b8e761ad2 3fa82c09f4614412b7f5a7e917a42c8b8e761ad2
Total tests
747
Failing since
#269 (Code changes detected – )
Fixed in
#271 (Code changes detected)

Tests

  • 747 tests in total
  • 1 test failed
  • 1 failure is new
  • 2 tests were fixed
  • 15 tests were quarantined / skipped
  • 21 minutes taken in total.
New test failures 1
Status Test Duration
Collapse Failed SyslogInboundChannelAdapterIntegrationTests testSyslogInboundChannelAdapter History
2 mins
java.lang.AssertionError: java.lang.AssertionError: Latch did not time out
java.lang.AssertionError: Latch did not time out
	at org.junit.Assert.fail(Assert.java:88)
	at org.junit.Assert.assertTrue(Assert.java:41)
	at org.springframework.xd.integration.reactor.SyslogInboundChannelAdapterIntegrationTests.testSyslogInboundChannelAdapter(SyslogInboundChannelAdapterIntegrationTests.java:120)
	at sun.reflect.NativeMethodAccessorImpl.invoke0(Native Method)
	at sun.reflect.NativeMethodAccessorImpl.invoke(NativeMethodAccessorImpl.java:62)
	at sun.reflect.DelegatingMethodAccessorImpl.invoke(DelegatingMethodAccessorImpl.java:43)
(46 more lines...)
Fixed tests 2
Status Test Failing since Duration
Successful RedisQueueInboundChannelAdapterTests testCustomPayloadSerializer History
Failing since build #269 (Code changes detected) < 1 sec
Successful FileSourceModuleTests testFileContentsUsingDefaultMode History
Failing since build #269 (Code changes detected) 2 secs