Windows 2008 x86_64 EC2 build

Build: #283 failed

Job: Default Job failed

Stages & jobs

  1. Default Stage

Job result summary

Completed
Duration
56 minutes
Agent
(elastic) Elastic Agent on i-c3131a60
Revision
9307f1fba347adf59c8b489ae7fe0aa9bfd9b6a6 9307f1fba347adf59c8b489ae7fe0aa9bfd9b6a6
Total tests
1316
Failing since
#282 (Code changes detected – )
Fixed in
#285 (Manual run by Mark Pollack)

Tests

  • 1,316 tests in total
  • 1 test failed
  • 1 failure is new
  • 1 test was fixed
  • 93 tests were quarantined / skipped
  • 39 minutes taken in total.
New test failures 1
Status Test Duration
Collapse Failed LocalTransportSparkStreamingTests testSparkFileLoggerWithInputType History
42 secs
java.lang.AssertionError: java.lang.AssertionError: 
Expected: a string ending with "foo foo foo\r\n", trying at most 50 times
     but: failed after 50*100=5000ms:
"", "", "", "", "", "", "", "", 
java.lang.AssertionError: 
Expected: a string ending with "foo foo foo\r\n", trying at most 50 times
     but: failed after 50*100=5000ms:
"", "", "", "", "", "", "", "", 
(50 more lines...)
Fixed tests 1
Status Test Failing since Duration
Successful FileSourceModuleTests testFileContentsUsingDefaultMode History
Failing since build #282 (Code changes detected) 2 secs