Windows 2008 x86_64 EC2 build

Build: #283 failed

Job: Default Job failed

Stages & jobs

  1. Default Stage

Test results

  • 1,316 tests in total
  • 1 test failed
  • 1 failure is new
  • 1 test was fixed
  • 93 tests were quarantined / skipped
  • 39 minutes taken in total.

Build 283 has the following 1 errors: 1 new failure(s) occurred since the previous build.

New test failures 1
Status Test Duration
Collapse Failed LocalTransportSparkStreamingTests testSparkFileLoggerWithInputType History
42 secs
java.lang.AssertionError: java.lang.AssertionError: 
Expected: a string ending with "foo foo foo\r\n", trying at most 50 times
     but: failed after 50*100=5000ms:
"", "", "", "", "", "", "", "", 
java.lang.AssertionError: 
Expected: a string ending with "foo foo foo\r\n", trying at most 50 times
     but: failed after 50*100=5000ms:
"", "", "", "", "", "", "", "", 
(50 more lines...)