Windows 2008 x86_64 EC2 build

Build: #292 failed

Job: Default Job failed

Stages & jobs

  1. Default Stage

Module defaults come5th: Test case result

The below summarizes the result of the test "Module defaults come5th" in build 292 of Spring XD - Windows EC2 (master, JDK8) - Default Job. View test case history
Description
Module defaults come5th
Test class
org.springframework.xd.dirt.stream.ModuleOptionsDefaultsOrderingTests
Method
testModuleDefaultsCome5th
Duration
9 secs
Status
Failed (New Failure)

Error Log

org.springframework.beans.factory.BeanCreationException: org.springframework.beans.factory.BeanCreationException: Error creating bean with name 'jobsController': Injection of autowired dependencies failed; nested exception is org.springframework.beans.factory.BeanCreationException: Could not autowire field: private org.springframework.xd.dirt.server.admin.deployment.DeploymentMessagePublisher org.springframework.xd.dirt.rest.XDController.deploymentMessagePublisher; nested exception is org.springframework.beans.factory.BeanCreationException: Error creating bean with name 'deploymentMessageProducer' defined in class org.springframework.xd.dirt.server.admin.deployment.zk.DeploymentConfiguration: Bean instantiation via factory method failed; nested exception is org.springframework.beans.BeanInstantiationException: Failed to instantiate [org.springframework.xd.dirt.server.admin.deployment.zk.ZKDeploymentMessagePublisher]: Factory method 'deploymentMessageProducer' threw exception; nested exception is org.springframework.beans.factory.BeanCreationException: Error creating bean with name 'deploymentQueue' defined in class org.springframework.xd.dirt.server.admin.deployment.zk.DeploymentConfiguration: Invocation of init method failed; nested exception is java.lang.IllegalArgumentException: Path must start with / character
org.springframework.beans.factory.BeanCreationException: Error creating bean with name 'jobsController': Injection of autowired dependencies failed; nested exception is org.springframework.beans.factory.BeanCreationException: Could not autowire field: private org.springframework.xd.dirt.server.admin.deployment.DeploymentMessagePublisher org.springframework.xd.dirt.rest.XDController.deploymentMessagePublisher; nested exception is org.springframework.beans.factory.BeanCreationException: Error creating bean with name 'deploymentMessageProducer' defined in class org.springframework.xd.dirt.server.admin.deployment.zk.DeploymentConfiguration: Bean instantiation via factory method failed; nested exception is org.springframework.beans.BeanInstantiationException: Failed to instantiate [org.springframework.xd.dirt.server.admin.deployment.zk.ZKDeploymentMessagePublisher]: Factory method 'deploymentMessageProducer' threw exception; nested exception is org.springframework.beans.factory.BeanCreationException: Error creating bean with name 'deploymentQueue' defined in class org.springframework.xd.dirt.server.admin.deployment.zk.DeploymentConfiguration: Invocation of init method failed; nested exception is java.lang.IllegalArgumentException: Path must start with / character
	at org.springframework.beans.factory.annotation.AutowiredAnnotationBeanPostProcessor.postProcessPropertyValues(AutowiredAnnotationBeanPostProcessor.java:334)
	at org.springframework.beans.factory.support.AbstractAutowireCapableBeanFactory.populateBean(AbstractAutowireCapableBeanFactory.java:1214)
	at org.springframework.beans.factory.support.AbstractAutowireCapableBeanFactory.doCreateBean(AbstractAutowireCapableBeanFactory.java:543)
	at org.springframework.beans.factory.support.AbstractAutowireCapableBeanFactory.createBean(AbstractAutowireCapableBeanFactory.java:482)
	at org.springframework.beans.factory.support.AbstractBeanFactory$1.getObject(AbstractBeanFactory.java:305)
	at org.springframework.beans.factory.support.DefaultSingletonBeanRegistry.getSingleton(DefaultSingletonBeanRegistry.java:230)
	at org.springframework.beans.factory.support.AbstractBeanFactory.doGetBean(AbstractBeanFactory.java:301)
	at org.springframework.beans.factory.support.AbstractBeanFactory.getBean(AbstractBeanFactory.java:196)
	at org.springframework.beans.factory.support.DefaultListableBeanFactory.preInstantiateSingletons(DefaultListableBeanFactory.java:772)
	at org.springframework.context.support.AbstractApplicationContext.finishBeanFactoryInitialization(AbstractApplicationContext.java:834)
	at org.springframework.context.support.AbstractApplicationContext.refresh(AbstractApplicationContext.java:537)
	at org.springframework.boot.context.embedded.EmbeddedWebApplicationContext.refresh(EmbeddedWebApplicationContext.java:118)
	at org.springframework.boot.SpringApplication.refresh(SpringApplication.java:686)
	at org.springframework.boot.SpringApplication.run(SpringApplication.java:320)
	at org.springframework.boot.builder.SpringApplicationBuilder.run(SpringApplicationBuilder.java:139)
	at org.springframework.xd.dirt.server.singlenode.SingleNodeApplication.run(SingleNodeApplication.java:76)
	at org.springframework.xd.dirt.stream.ModuleOptionsDefaultsOrderingTests.runTestAndExpect(ModuleOptionsDefaultsOrderingTests.java:135)
	at org.springframework.xd.dirt.stream.ModuleOptionsDefaultsOrderingTests.testModuleDefaultsCome5th(ModuleOptionsDefaultsOrderingTests.java:105)
	at sun.reflect.NativeMethodAccessorImpl.invoke0(Native Method)
	at sun.reflect.NativeMethodAccessorImpl.invoke(NativeMethodAccessorImpl.java:62)
	at sun.reflect.DelegatingMethodAccessorImpl.invoke(DelegatingMethodAccessorImpl.java:43)
	at java.lang.reflect.Method.invoke(Method.java:483)
	at org.junit.runners.model.FrameworkMethod$1.runReflectiveCall(FrameworkMethod.java:50)
	at org.junit.internal.runners.model.ReflectiveCallable.run(ReflectiveCallable.java:12)
	at org.junit.runners.model.FrameworkMethod.invokeExplosively(FrameworkMethod.java:47)
	at org.junit.internal.runners.statements.InvokeMethod.evaluate(InvokeMethod.java:17)
	at org.junit.internal.runners.statements.RunBefores.evaluate(RunBefores.java:26)
	at org.junit.internal.runners.statements.RunAfters.evaluate(RunAfters.java:27)
	at org.junit.runners.ParentRunner.runLeaf(ParentRunner.java:325)
	at org.junit.runners.BlockJUnit4ClassRunner.runChild(BlockJUnit4ClassRunner.java:78)
	at org.junit.runners.BlockJUnit4ClassRunner.runChild(BlockJUnit4ClassRunner.java:57)
	at org.junit.runners.ParentRunner$3.run(ParentRunner.java:290)
	at org.junit.runners.ParentRunner$1.schedule(ParentRunner.java:71)
	at org.junit.runners.ParentRunner.runChildren(ParentRunner.java:288)
	at org.junit.runners.ParentRunner.access$000(ParentRunner.java:58)
	at org.junit.runners.ParentRunner$2.evaluate(ParentRunner.java:268)
	at org.junit.runners.ParentRunner.run(ParentRunner.java:363)
	at org.gradle.api.internal.tasks.testing.junit.JUnitTestClassExecuter.runTestClass(JUnitTestClassExecuter.java:86)
	at org.gradle.api.internal.tasks.testing.junit.JUnitTestClassExecuter.execute(JUnitTestClassExecuter.java:49)
	at org.gradle.api.internal.tasks.testing.junit.JUnitTestClassProcessor.processTestClass(JUnitTestClassProcessor.java:69)
	at org.gradle.api.internal.tasks.testing.SuiteTestClassProcessor.processTestClass(SuiteTestClassProcessor.java:48)
	at sun.reflect.GeneratedMethodAccessor54.invoke(Unknown Source)
	at sun.reflect.DelegatingMethodAccessorImpl.invoke(DelegatingMethodAccessorImpl.java:43)
	at java.lang.reflect.Method.invoke(Method.java:483)
	at org.gradle.messaging.dispatch.ReflectionDispatch.dispatch(ReflectionDispatch.java:35)
	at org.gradle.messaging.dispatch.ReflectionDispatch.dispatch(ReflectionDispatch.java:24)
	at org.gradle.messaging.dispatch.ContextClassLoaderDispatch.dispatch(ContextClassLoaderDispatch.java:32)
	at org.gradle.messaging.dispatch.ProxyDispatchAdapter$DispatchingInvocationHandler.invoke(ProxyDispatchAdapter.java:93)
	at com.sun.proxy.$Proxy2.processTestClass(Unknown Source)
	at org.gradle.api.internal.tasks.testing.worker.TestWorker.processTestClass(TestWorker.java:105)
	at sun.reflect.GeneratedMethodAccessor53.invoke(Unknown Source)
	at sun.reflect.DelegatingMethodAccessorImpl.invoke(DelegatingMethodAccessorImpl.java:43)
	at java.lang.reflect.Method.invoke(Method.java:483)
	at org.gradle.messaging.dispatch.ReflectionDispatch.dispatch(ReflectionDispatch.java:35)
	at org.gradle.messaging.dispatch.ReflectionDispatch.dispatch(ReflectionDispatch.java:24)
	at org.gradle.messaging.remote.internal.hub.MessageHub$Handler.run(MessageHub.java:360)
	at org.gradle.internal.concurrent.DefaultExecutorFactory$StoppableExecutorImpl$1.run(DefaultExecutorFactory.java:64)
	at java.util.concurrent.ThreadPoolExecutor.runWorker(ThreadPoolExecutor.java:1142)
	at java.util.concurrent.ThreadPoolExecutor$Worker.run(ThreadPoolExecutor.java:617)
	at java.lang.Thread.run(Thread.java:745)
Caused by: org.springframework.beans.factory.BeanCreationException: Could not autowire field: private org.springframework.xd.dirt.server.admin.deployment.DeploymentMessagePublisher org.springframework.xd.dirt.rest.XDController.deploymentMessagePublisher; nested exception is org.springframework.beans.factory.BeanCreationException: Error creating bean with name 'deploymentMessageProducer' defined in class org.springframework.xd.dirt.server.admin.deployment.zk.DeploymentConfiguration: Bean instantiation via factory method failed; nested exception is org.springframework.beans.BeanInstantiationException: Failed to instantiate [org.springframework.xd.dirt.server.admin.deployment.zk.ZKDeploymentMessagePublisher]: Factory method 'deploymentMessageProducer' threw exception; nested exception is org.springframework.beans.factory.BeanCreationException: Error creating bean with name 'deploymentQueue' defined in class org.springframework.xd.dirt.server.admin.deployment.zk.DeploymentConfiguration: Invocation of init method failed; nested exception is java.lang.IllegalArgumentException: Path must start with / character
	at org.springframework.beans.factory.annotation.AutowiredAnnotationBeanPostProcessor$AutowiredFieldElement.inject(AutowiredAnnotationBeanPostProcessor.java:571)
	at org.springframework.beans.factory.annotation.InjectionMetadata.inject(InjectionMetadata.java:88)
	at org.springframework.beans.factory.annotation.AutowiredAnnotationBeanPostProcessor.postProcessPropertyValues(AutowiredAnnotationBeanPostProcessor.java:331)
	... 59 more
Caused by: org.springframework.beans.factory.BeanCreationException: Error creating bean with name 'deploymentMessageProducer' defined in class org.springframework.xd.dirt.server.admin.deployment.zk.DeploymentConfiguration: Bean instantiation via factory method failed; nested exception is org.springframework.beans.BeanInstantiationException: Failed to instantiate [org.springframework.xd.dirt.server.admin.deployment.zk.ZKDeploymentMessagePublisher]: Factory method 'deploymentMessageProducer' threw exception; nested exception is org.springframework.beans.factory.BeanCreationException: Error creating bean with name 'deploymentQueue' defined in class org.springframework.xd.dirt.server.admin.deployment.zk.DeploymentConfiguration: Invocation of init method failed; nested exception is java.lang.IllegalArgumentException: Path must start with / character
	at org.springframework.beans.factory.support.ConstructorResolver.instantiateUsingFactoryMethod(ConstructorResolver.java:599)
	at org.springframework.beans.factory.support.AbstractAutowireCapableBeanFactory.instantiateUsingFactoryMethod(AbstractAutowireCapableBeanFactory.java:1123)
	at org.springframework.beans.factory.support.AbstractAutowireCapableBeanFactory.createBeanInstance(AbstractAutowireCapableBeanFactory.java:1018)
	at org.springframework.beans.factory.support.AbstractAutowireCapableBeanFactory.doCreateBean(AbstractAutowireCapableBeanFactory.java:510)
	at org.springframework.beans.factory.support.AbstractAutowireCapableBeanFactory.createBean(AbstractAutowireCapableBeanFactory.java:482)
	at org.springframework.beans.factory.support.AbstractBeanFactory$1.getObject(AbstractBeanFactory.java:305)
	at org.springframework.beans.factory.support.DefaultSingletonBeanRegistry.getSingleton(DefaultSingletonBeanRegistry.java:230)
	at org.springframework.beans.factory.support.AbstractBeanFactory.doGetBean(AbstractBeanFactory.java:301)
	at org.springframework.beans.factory.support.AbstractBeanFactory.getBean(AbstractBeanFactory.java:196)
	at org.springframework.beans.factory.support.DefaultListableBeanFactory.findAutowireCandidates(DefaultListableBeanFactory.java:1145)
	at org.springframework.beans.factory.support.DefaultListableBeanFactory.doResolveDependency(DefaultListableBeanFactory.java:1069)
	at org.springframework.beans.factory.support.DefaultListableBeanFactory.resolveDependency(DefaultListableBeanFactory.java:967)
	at org.springframework.beans.factory.annotation.AutowiredAnnotationBeanPostProcessor$AutowiredFieldElement.inject(AutowiredAnnotationBeanPostProcessor.java:543)
	... 61 more
Caused by: org.springframework.beans.BeanInstantiationException: Failed to instantiate [org.springframework.xd.dirt.server.admin.deployment.zk.ZKDeploymentMessagePublisher]: Factory method 'deploymentMessageProducer' threw exception; nested exception is org.springframework.beans.factory.BeanCreationException: Error creating bean with name 'deploymentQueue' defined in class org.springframework.xd.dirt.server.admin.deployment.zk.DeploymentConfiguration: Invocation of init method failed; nested exception is java.lang.IllegalArgumentException: Path must start with / character
	at org.springframework.beans.factory.support.SimpleInstantiationStrategy.instantiate(SimpleInstantiationStrategy.java:189)
	at org.springframework.beans.factory.support.ConstructorResolver.instantiateUsingFactoryMethod(ConstructorResolver.java:588)
	... 73 more
Caused by: org.springframework.beans.factory.BeanCreationException: Error creating bean with name 'deploymentQueue' defined in class org.springframework.xd.dirt.server.admin.deployment.zk.DeploymentConfiguration: Invocation of init method failed; nested exception is java.lang.IllegalArgumentException: Path must start with / character
	at org.springframework.beans.factory.support.AbstractAutowireCapableBeanFactory.initializeBean(AbstractAutowireCapableBeanFactory.java:1578)
	at org.springframework.beans.factory.support.AbstractAutowireCapableBeanFactory.doCreateBean(AbstractAutowireCapableBeanFactory.java:545)
	at org.springframework.beans.factory.support.AbstractAutowireCapableBeanFactory.createBean(AbstractAutowireCapableBeanFactory.java:482)
	at org.springframework.beans.factory.support.AbstractBeanFactory$1.getObject(AbstractBeanFactory.java:305)
	at org.springframework.beans.factory.support.DefaultSingletonBeanRegistry.getSingleton(DefaultSingletonBeanRegistry.java:230)
	at org.springframework.beans.factory.support.AbstractBeanFactory.doGetBean(AbstractBeanFactory.java:301)
	at org.springframework.beans.factory.support.AbstractBeanFactory.getBean(AbstractBeanFactory.java:196)
	at org.springframework.context.annotation.ConfigurationClassEnhancer$BeanMethodInterceptor.intercept(ConfigurationClassEnhancer.java:331)
	at org.springframework.xd.dirt.server.admin.deployment.zk.DeploymentConfiguration$$EnhancerBySpringCGLIB$$714ab3ea.deploymentQueue(<generated>)
	at org.springframework.xd.dirt.server.admin.deployment.zk.DeploymentConfiguration.deploymentMessageProducer(DeploymentConfiguration.java:153)
	at org.springframework.xd.dirt.server.admin.deployment.zk.DeploymentConfiguration$$EnhancerBySpringCGLIB$$714ab3ea.CGLIB$deploymentMessageProducer$3(<generated>)
	at org.springframework.xd.dirt.server.admin.deployment.zk.DeploymentConfiguration$$EnhancerBySpringCGLIB$$714ab3ea$$FastClassBySpringCGLIB$$1f2810ee.invoke(<generated>)
	at org.springframework.cglib.proxy.MethodProxy.invokeSuper(MethodProxy.java:228)
	at org.springframework.context.annotation.ConfigurationClassEnhancer$BeanMethodInterceptor.intercept(ConfigurationClassEnhancer.java:318)
	at org.springframework.xd.dirt.server.admin.deployment.zk.DeploymentConfiguration$$EnhancerBySpringCGLIB$$714ab3ea.deploymentMessageProducer(<generated>)
	at sun.reflect.NativeMethodAccessorImpl.invoke0(Native Method)
	at sun.reflect.NativeMethodAccessorImpl.invoke(NativeMethodAccessorImpl.java:62)
	at sun.reflect.DelegatingMethodAccessorImpl.invoke(DelegatingMethodAccessorImpl.java:43)
	at java.lang.reflect.Method.invoke(Method.java:483)
	at org.springframework.beans.factory.support.SimpleInstantiationStrategy.instantiate(SimpleInstantiationStrategy.java:162)
	... 74 more
Caused by: java.lang.IllegalArgumentException: Path must start with / character
	at org.apache.curator.utils.PathUtils.validatePath(PathUtils.java:54)
	at org.apache.curator.framework.recipes.queue.QueueBuilder.<init>(QueueBuilder.java:269)
	at org.apache.curator.framework.recipes.queue.QueueBuilder.builder(QueueBuilder.java:64)
	at org.springframework.xd.dirt.server.admin.deployment.zk.DeploymentQueue.start(DeploymentQueue.java:122)
	at org.springframework.xd.dirt.server.admin.deployment.zk.DeploymentQueue.afterPropertiesSet(DeploymentQueue.java:153)
	at org.springframework.beans.factory.support.AbstractAutowireCapableBeanFactory.invokeInitMethods(AbstractAutowireCapableBeanFactory.java:1637)
	at org.springframework.beans.factory.support.AbstractAutowireCapableBeanFactory.initializeBean(AbstractAutowireCapableBeanFactory.java:1574)
	... 93 more