Windows 2008 x86_64 EC2 build

Build: #333 failed

Job: Default Job failed

Stages & jobs

  1. Default Stage

Job result summary

Completed
Duration
66 minutes
Agent
(elastic) Elastic Agent on i-336c9a8d
Revision
980d2a6b7467cd4e271c33ed24490ef9feae4bcf 980d2a6b7467cd4e271c33ed24490ef9feae4bcf
Total tests
1390
Fixed in
#334 (Code changes detected)

Tests

  • 1,390 tests in total
  • 1 test failed
  • 1 failure is new
  • 98 tests were quarantined / skipped
  • 38 minutes taken in total.
New test failures 1
Status Test Duration
Collapse Failed JobCommandsWithSecurityTests doStopJobExecution History
42 secs
java.lang.AssertionError: java.lang.AssertionError: Failure.  CommandResult = CommandResult [success=false, result=null, exception=org.springframework.xd.rest.client.impl.SpringXDException: Job execution with executionId 5 is not running.
]
java.lang.AssertionError: Failure.  CommandResult = CommandResult [success=false, result=null, exception=org.springframework.xd.rest.client.impl.SpringXDException: Job execution with executionId 5 is not running.
]
	at org.junit.Assert.fail(Assert.java:88)
	at org.junit.Assert.assertTrue(Assert.java:41)
	at org.springframework.xd.shell.AbstractShellIntegrationTest.executeCommand(AbstractShellIntegrationTest.java:197)
	at org.springframework.xd.shell.command.AbstractJobCommandsTests.doStopJobExecution(AbstractJobCommandsTests.java:470)
(62 more lines...)