Windows 2008 x86_64 EC2 build

Build: #347 failed

Job: Default Job failed

Stages & jobs

  1. Default Stage

Job result summary

Completed
Duration
52 minutes
Agent
(elastic) Elastic Agent on i-618e05df
Revision
d7d2abfb9ae801e7165902cb57bfa124af6c66e2 d7d2abfb9ae801e7165902cb57bfa124af6c66e2
Total tests
1402
Failing since
#346 (Code changes detected – )
Fixed in
#348 (Code changes detected)

Tests

  • 1,402 tests in total
  • 1 test failed
  • 109 tests were quarantined / skipped
  • 31 minutes taken in total.
Existing test failures 1
Status Test Failing since Duration
java.lang.AssertionError: java.lang.AssertionError: Failure.  CommandResult = CommandResult [success=false, result=null, exception=org.springframework.xd.rest.client.impl.SpringXDException: Job execution with executionId 5 is not running.
]
java.lang.AssertionError: Failure.  CommandResult = CommandResult [success=false, result=null, exception=org.springframework.xd.rest.client.impl.SpringXDException: Job execution with executionId 5 is not running.
]
	at org.junit.Assert.fail(Assert.java:88)
	at org.junit.Assert.assertTrue(Assert.java:41)
	at org.springframework.xd.shell.AbstractShellIntegrationTest.executeCommand(AbstractShellIntegrationTest.java:197)
	at org.springframework.xd.shell.command.AbstractJobCommandsTests.doStopJobExecution(AbstractJobCommandsTests.java:470)
(62 more lines...)