Windows 2008 x86_64 EC2 build

Build: #354 failed

Job: Default Job failed

Stages & jobs

  1. Default Stage

Job result summary

Completed
Duration
46 minutes
Agent
(elastic) Elastic Agent on i-ed58fa6d
Revision
8323aa0b68a76039b381674ef176ebd54701a170 8323aa0b68a76039b381674ef176ebd54701a170
Total tests
964
Failing since
#353 (Code changes detected – )
Fixed in
#362 (Manual run by Mark Pollack)

Tests

  • 964 tests in total
  • 1 test failed
  • 1 failure is new
  • 81 tests were quarantined / skipped
  • 17 minutes taken in total.
New test failures 1
Status Test Duration
Collapse Failed FileSourceModuleTests testFileContentsUsingDefaultMode History
4 secs
java.lang.AssertionError: java.lang.AssertionError
java.lang.AssertionError
	at org.junit.Assert.fail(Assert.java:86)
	at org.junit.Assert.assertTrue(Assert.java:41)
	at org.junit.Assert.assertTrue(Assert.java:52)
	at org.springframework.xd.dirt.stream.FileSourceModuleTests.testFileContentsUsingDefaultMode(FileSourceModuleTests.java:156)
	at sun.reflect.NativeMethodAccessorImpl.invoke0(Native Method)
	at sun.reflect.NativeMethodAccessorImpl.invoke(NativeMethodAccessorImpl.java:62)
(41 more lines...)