Windows 2008 x86_64 EC2 build

Build: #355 failed

Job: Default Job failed

Stages & jobs

  1. Default Stage

Job result summary

Completed
Duration
52 minutes
Agent
(elastic) Elastic Agent on i-4b53ebcb
Revision
8b89c82318a466ee2cf38ae6f945ad435a2fd340 8b89c82318a466ee2cf38ae6f945ad435a2fd340
Total tests
964
Failing since
#353 (Code changes detected – )
Fixed in
#362 (Manual run by Mark Pollack)

Tests

  • 964 tests in total
  • 1 test failed
  • 1 failure is new
  • 1 test was fixed
  • 81 tests were quarantined / skipped
  • 21 minutes taken in total.
New test failures 1
Status Test Duration
Collapse Failed SingleNodeApplicationWithDefaultSecurityTest testSslNotEnabledByDefaultForManagementEndpoints History
22 secs
org.springframework.web.client.ResourceAccessException: org.springframework.web.client.ResourceAccessException: I/O error on GET request for "http://localhost:64075/management/metrics": Read timed out; nested exception is java.net.SocketTimeoutException: Read timed out
org.springframework.web.client.ResourceAccessException: I/O error on GET request for "http://localhost:64075/management/metrics": Read timed out; nested exception is java.net.SocketTimeoutException: Read timed out
	at org.springframework.web.client.RestTemplate.doExecute(RestTemplate.java:607)
	at org.springframework.web.client.RestTemplate.execute(RestTemplate.java:557)
	at org.springframework.web.client.RestTemplate.getForEntity(RestTemplate.java:289)
	at org.springframework.xd.dirt.security.SingleNodeApplicationWithDefaultSecurityTest.testSslNotEnabledByDefaultForManagementEndpoints(SingleNodeApplicationWithDefaultSecurityTest.java:95)
	at sun.reflect.NativeMethodAccessorImpl.invoke0(Native Method)
	at sun.reflect.NativeMethodAccessorImpl.invoke(NativeMethodAccessorImpl.java:62)
(60 more lines...)
Fixed tests 1
Status Test Failing since Duration
Successful FileSourceModuleTests testFileContentsUsingDefaultMode History
Failing since build #354 (Code changes detected) 2 secs