Windows 2008 x86_64 EC2 build

Build: #357 failed

Job: Default Job failed

Stages & jobs

  1. Default Stage

Job result summary

Completed
Duration
56 minutes
Agent
(elastic) Elastic Agent on i-5934bed9
Revision
52a7c23cbd9cb75962c3f4df3bf1ca3f7af7f626 52a7c23cbd9cb75962c3f4df3bf1ca3f7af7f626
Total tests
965
Failing since
#353 (Code changes detected – )
Fixed in
#362 (Manual run by Mark Pollack)

Tests

  • 965 tests in total
  • 1 test failed
  • 82 tests were quarantined / skipped
  • 23 minutes taken in total.
Existing test failures 1
Status Test Failing since Duration
org.springframework.web.client.ResourceAccessException: org.springframework.web.client.ResourceAccessException: I/O error on GET request for "http://localhost:64976/management/metrics": Read timed out; nested exception is java.net.SocketTimeoutException: Read timed out
org.springframework.web.client.ResourceAccessException: I/O error on GET request for "http://localhost:64976/management/metrics": Read timed out; nested exception is java.net.SocketTimeoutException: Read timed out
	at org.springframework.web.client.RestTemplate.doExecute(RestTemplate.java:607)
	at org.springframework.web.client.RestTemplate.execute(RestTemplate.java:557)
	at org.springframework.web.client.RestTemplate.getForEntity(RestTemplate.java:289)
	at org.springframework.xd.dirt.security.SingleNodeApplicationWithDefaultSecurityTest.testSslNotEnabledByDefaultForManagementEndpoints(SingleNodeApplicationWithDefaultSecurityTest.java:95)
	at sun.reflect.NativeMethodAccessorImpl.invoke0(Native Method)
	at sun.reflect.NativeMethodAccessorImpl.invoke(NativeMethodAccessorImpl.java:62)
(60 more lines...)