Windows 2008 x86_64 EC2 build

Build: #359 failed

Job: Default Job failed

Stages & jobs

  1. Default Stage

Test results

  • 90 tests in total
  • 1 test failed
  • 1 failure is new
  • 31 tests were quarantined / skipped
  • 13 seconds taken in total.

Build 359 has the following 1 errors: 1 new failure(s) occurred since the previous build.

New test failures 1
Status Test Duration
Collapse Failed GaugeHandlerTests testhandlerWithExpression History
5 secs
org.springframework.messaging.MessageHandlingException: org.springframework.messaging.MessageHandlingException: nested exception is org.springframework.data.redis.RedisConnectionFailureException: java.net.SocketTimeoutException: Read timed out; nested exception is redis.clients.jedis.exceptions.JedisConnectionException: java.net.SocketTimeoutException: Read timed out
org.springframework.messaging.MessageHandlingException: nested exception is org.springframework.data.redis.RedisConnectionFailureException: java.net.SocketTimeoutException: Read timed out; nested exception is redis.clients.jedis.exceptions.JedisConnectionException: java.net.SocketTimeoutException: Read timed out
	at org.springframework.integration.handler.MethodInvokingMessageProcessor.processMessage(MethodInvokingMessageProcessor.java:96)
	at org.springframework.integration.handler.ServiceActivatingHandler.handleRequestMessage(ServiceActivatingHandler.java:89)
	at org.springframework.integration.handler.AbstractReplyProducingMessageHandler.handleMessageInternal(AbstractReplyProducingMessageHandler.java:99)
	at org.springframework.integration.handler.AbstractMessageHandler.handleMessage(AbstractMessageHandler.java:127)
	at org.springframework.integration.handler.MessageHandlerChain$1.send(MessageHandlerChain.java:123)
	at org.springframework.messaging.core.GenericMessagingTemplate.doSend(GenericMessagingTemplate.java:115)
(115 more lines...)