Windows 2008 x86_64 EC2 build

Build: #361 failed

Job: Default Job failed

Stages & jobs

  1. Default Stage

Job result summary

Completed
Duration
56 minutes
Agent
(elastic) Elastic Agent on i-6cd3a5ec
Revision
a42ccbcc3c233bc5c784262958e5e0ed001f247f a42ccbcc3c233bc5c784262958e5e0ed001f247f
Total tests
965
Failing since
#353 (Code changes detected – )
Fixed in
#362 (Manual run by Mark Pollack)

Tests

  • 965 tests in total
  • 6 tests failed
  • 6 failures are new
  • 1 test was fixed
  • 82 tests were quarantined / skipped
  • 21 minutes taken in total.
New test failures 6
Status Test Duration
Collapse Failed RedisMessageBusTests createInboundPubSubBeforeOutboundPubSub History
32 secs
java.lang.AssertionError: java.lang.AssertionError: Failed to receive tap after retry
java.lang.AssertionError: Failed to receive tap after retry
	at org.junit.Assert.fail(Assert.java:88)
	at org.junit.Assert.assertTrue(Assert.java:41)
	at org.junit.Assert.assertFalse(Assert.java:64)
	at org.springframework.xd.dirt.integration.bus.AbstractMessageBusTests.createInboundPubSubBeforeOutboundPubSub(AbstractMessageBusTests.java:225)
	at sun.reflect.NativeMethodAccessorImpl.invoke0(Native Method)
	at sun.reflect.NativeMethodAccessorImpl.invoke(NativeMethodAccessorImpl.java:62)
(42 more lines...)
Collapse Failed RedisMessageBusTests testRetryFail History
18 secs
java.lang.AssertionError: java.lang.AssertionError
java.lang.AssertionError
	at org.junit.Assert.fail(Assert.java:86)
	at org.junit.Assert.assertTrue(Assert.java:41)
	at org.junit.Assert.assertNotNull(Assert.java:712)
	at org.junit.Assert.assertNotNull(Assert.java:722)
	at org.springframework.xd.dirt.integration.bus.redis.RedisMessageBusTests.testRetryFail(RedisMessageBusTests.java:335)
	at sun.reflect.NativeMethodAccessorImpl.invoke0(Native Method)
(43 more lines...)
Collapse Failed RedisMessageBusTests testSendAndReceivePubSub History
7 secs
java.lang.AssertionError: java.lang.AssertionError
java.lang.AssertionError
	at org.junit.Assert.fail(Assert.java:86)
	at org.junit.Assert.assertTrue(Assert.java:41)
	at org.junit.Assert.assertNotNull(Assert.java:712)
	at org.junit.Assert.assertNotNull(Assert.java:722)
	at org.springframework.xd.dirt.integration.bus.AbstractMessageBusTests.testSendAndReceivePubSub(AbstractMessageBusTests.java:146)
	at org.springframework.xd.dirt.integration.bus.redis.RedisMessageBusTests.testSendAndReceivePubSub(RedisMessageBusTests.java:89)
(44 more lines...)
Collapse Failed RedisPublishingMessageHandlerTests testWithDefaultSerializer History
4 secs
java.lang.AssertionError: java.lang.AssertionError: expected:<0> but was:<10>
java.lang.AssertionError: expected:<0> but was:<10>
	at org.junit.Assert.fail(Assert.java:88)
	at org.junit.Assert.failNotEquals(Assert.java:834)
	at org.junit.Assert.assertEquals(Assert.java:645)
	at org.junit.Assert.assertEquals(Assert.java:631)
	at org.springframework.xd.dirt.integration.redis.RedisPublishingMessageHandlerTests.testWithDefaultSerializer(RedisPublishingMessageHandlerTests.java:81)
	at sun.reflect.NativeMethodAccessorImpl.invoke0(Native Method)
(42 more lines...)
Collapse Failed RedisQueueInboundChannelAdapterTests testDefaultMsgSerializer History
1 sec
java.lang.NullPointerException: java.lang.NullPointerException
java.lang.NullPointerException
	at org.springframework.xd.dirt.integration.redis.RedisQueueInboundChannelAdapterTests.testDefaultMsgSerializer(RedisQueueInboundChannelAdapterTests.java:124)
	at sun.reflect.NativeMethodAccessorImpl.invoke0(Native Method)
	at sun.reflect.NativeMethodAccessorImpl.invoke(NativeMethodAccessorImpl.java:62)
	at sun.reflect.DelegatingMethodAccessorImpl.invoke(DelegatingMethodAccessorImpl.java:43)
	at java.lang.reflect.Method.invoke(Method.java:483)
	at org.junit.runners.model.FrameworkMethod$1.runReflectiveCall(FrameworkMethod.java:50)
(39 more lines...)
Collapse Failed RedisQueueInboundChannelAdapterTests testDefaultPayloadSerializer History
1 sec
java.lang.AssertionError: java.lang.AssertionError
java.lang.AssertionError
	at org.junit.Assert.fail(Assert.java:86)
	at org.junit.Assert.assertTrue(Assert.java:41)
	at org.junit.Assert.assertNotNull(Assert.java:712)
	at org.junit.Assert.assertNotNull(Assert.java:722)
	at org.springframework.xd.dirt.integration.redis.RedisQueueInboundChannelAdapterTests.testDefaultPayloadSerializer(RedisQueueInboundChannelAdapterTests.java:103)
	at sun.reflect.NativeMethodAccessorImpl.invoke0(Native Method)
(43 more lines...)
Fixed tests 1
Status Test Failing since Duration
Successful GaugeHandlerTests testhandlerWithExpression History
Failing since build #359 (Code changes detected) < 1 sec