Windows 2008 x86_64 EC2 build

Build: #364 failed

Job: Default Job failed

Stages & jobs

  1. Default Stage

Job result summary

Completed
Duration
53 minutes
Agent
(elastic) Elastic Agent on i-818fd701
Revision
8606f286463760c8fa0fbacd0e4593e7cc14d852 8606f286463760c8fa0fbacd0e4593e7cc14d852
Total tests
966
Fixed in
#365 (Code changes detected)

Tests

  • 966 tests in total
  • 1 test failed
  • 1 failure is new
  • 82 tests were quarantined / skipped
  • 21 minutes taken in total.
New test failures 1
Status Test Duration
Collapse Failed FileSourceModuleTests testFileContentsUsingDefaultMode History
5 secs
java.lang.AssertionError: java.lang.AssertionError
java.lang.AssertionError
	at org.junit.Assert.fail(Assert.java:86)
	at org.junit.Assert.assertTrue(Assert.java:41)
	at org.junit.Assert.assertTrue(Assert.java:52)
	at org.springframework.xd.dirt.stream.FileSourceModuleTests.testFileContentsUsingDefaultMode(FileSourceModuleTests.java:156)
	at sun.reflect.NativeMethodAccessorImpl.invoke0(Native Method)
	at sun.reflect.NativeMethodAccessorImpl.invoke(NativeMethodAccessorImpl.java:62)
(41 more lines...)