Windows 2008 x86_64 EC2 build

Build: #377 failed

Job: Default Job failed

Stages & jobs

  1. Default Stage

Test results

  • 968 tests in total
  • 3 tests failed
  • 3 failures are new
  • 82 tests were quarantined / skipped
  • 12 minutes taken in total.

Build 377 has the following 3 errors: 3 new failure(s) occurred since the previous build.

New test failures 3
Status Test Duration
Collapse Failed ExampleProcessingChainTests chainWithSink History
8 secs
java.lang.AssertionError: java.lang.AssertionError
java.lang.AssertionError
	at org.junit.Assert.fail(Assert.java:86)
	at org.junit.Assert.assertTrue(Assert.java:41)
	at org.junit.Assert.assertNotNull(Assert.java:712)
	at org.junit.Assert.assertNotNull(Assert.java:722)
	at org.springframework.xd.dirt.stream.ExampleProcessingChainTests.chainWithSink(ExampleProcessingChainTests.java:148)
	at sun.reflect.NativeMethodAccessorImpl.invoke0(Native Method)
(41 more lines...)
Collapse Failed ExampleProcessingChainTests processingChain History
6 secs
java.lang.AssertionError: java.lang.AssertionError: expected:<HELLO> but was:<null>
java.lang.AssertionError: expected:<HELLO> but was:<null>
	at org.junit.Assert.fail(Assert.java:88)
	at org.junit.Assert.failNotEquals(Assert.java:834)
	at org.junit.Assert.assertEquals(Assert.java:118)
	at org.junit.Assert.assertEquals(Assert.java:144)
	at org.springframework.xd.dirt.stream.ExampleProcessingChainTests.processingChain(ExampleProcessingChainTests.java:106)
	at sun.reflect.NativeMethodAccessorImpl.invoke0(Native Method)
(41 more lines...)
Collapse Failed ExampleProcessingChainTests testProcessingChain History
2 secs
java.lang.ClassCastException: java.lang.ClassCastException: org.joda.time.DateTime cannot be cast to java.lang.String
java.lang.ClassCastException: org.joda.time.DateTime cannot be cast to java.lang.String
	at org.springframework.xd.dirt.stream.ExampleProcessingChainTests.testProcessingChain(ExampleProcessingChainTests.java:81)
	at sun.reflect.NativeMethodAccessorImpl.invoke0(Native Method)
	at sun.reflect.NativeMethodAccessorImpl.invoke(NativeMethodAccessorImpl.java:62)
	at sun.reflect.DelegatingMethodAccessorImpl.invoke(DelegatingMethodAccessorImpl.java:43)
	at java.lang.reflect.Method.invoke(Method.java:483)
	at org.junit.runners.model.FrameworkMethod$1.runReflectiveCall(FrameworkMethod.java:50)
(37 more lines...)