Windows 2008 x86_64 EC2 build

Build: #72 failed

Job: Default Job failed

Stages & jobs

  1. Default Stage

Job result summary

Completed
Duration
48 minutes
Agent
(elastic) Elastic Agent on i-69e9a3be
Revision
a2b0107bb2efab1bc43dca98fedeb94dac80a7ed a2b0107bb2efab1bc43dca98fedeb94dac80a7ed
Total tests
948
Failing since
#14 (Rebuilt by Trevor Marshall)
Fixed in
#202 (Manual run by David Turanski)

Tests

  • 948 tests in total
  • 1 test failed
  • 1 failure is new
  • 5 tests were fixed
  • 60 tests were quarantined / skipped
  • 27 minutes taken in total.
New test failures 1
Status Test Duration
Collapse Failed ModuleCommandTests testDeleteComposedModuleUsedByStream History
1 sec
java.lang.AssertionError: java.lang.AssertionError
java.lang.AssertionError
	at org.junit.Assert.fail(Assert.java:86)
	at org.junit.Assert.assertTrue(Assert.java:41)
	at org.junit.Assert.assertFalse(Assert.java:64)
	at org.junit.Assert.assertFalse(Assert.java:74)
	at org.springframework.xd.shell.command.ModuleCommandTests.testDeleteComposedModuleUsedByStream(ModuleCommandTests.java:146)
	at sun.reflect.NativeMethodAccessorImpl.invoke0(Native Method)
(60 more lines...)
Fixed tests 5
Status Test Failing since Duration
Successful RedisMessageBusTests createInboundPubSubBeforeOutboundPubSub History
Failing since build #71 (Code changes detected) 11 secs
Successful RedisMessageBusTests testSendAndReceivePubSub History
Failing since build #71 (Code changes detected) 3 secs
Successful RedisQueueInboundChannelAdapterTests testDefaultMsgSerializer History
Failing since build #71 (Code changes detected) < 1 sec
Successful RedisQueueInboundChannelAdapterTests testDefaultPayloadSerializer History
Failing since build #71 (Code changes detected) < 1 sec
Successful FileSourceModuleTests testFileContents History
Failing since build #70 (Code changes detected) 2 secs