Windows 2008 x86_64 EC2 build

Build: #82 failed

Job: Default Job failed

Stages & jobs

  1. Default Stage

Job result summary

Completed
Duration
52 minutes
Agent
(elastic) Elastic Agent on i-b7143e98
Revision
e9d67377d2202a830cf254c545e024e5b618f425 e9d67377d2202a830cf254c545e024e5b618f425
Total tests
951
Failing since
#14 (Rebuilt by Trevor Marshall)
Fixed in
#202 (Manual run by David Turanski)

Tests

  • 951 tests in total
  • 1 test failed
  • 60 tests were quarantined / skipped
  • 28 minutes taken in total.
Existing test failures 1
Status Test Failing since Duration
java.lang.AssertionError: java.lang.AssertionError
java.lang.AssertionError
	at org.junit.Assert.fail(Assert.java:86)
	at org.junit.Assert.assertTrue(Assert.java:41)
	at org.junit.Assert.assertFalse(Assert.java:64)
	at org.junit.Assert.assertFalse(Assert.java:74)
	at org.springframework.xd.shell.command.ModuleCommandTests.testDeleteComposedModuleUsedByStream(ModuleCommandTests.java:179)
	at sun.reflect.NativeMethodAccessorImpl.invoke0(Native Method)
(60 more lines...)