Windows 2008 x86_64 EC2 build

Build: #88 failed

Job: Default Job failed

Stages & jobs

  1. Default Stage

Job result summary

Completed
Duration
46 minutes
Agent
(elastic) Elastic Agent on i-8338157f
Revision
8992ec09c7effb968f73033ff3ee3b6ba977b1de 8992ec09c7effb968f73033ff3ee3b6ba977b1de
Total tests
953
Failing since
#14 (Rebuilt by Trevor Marshall)
Fixed in
#202 (Manual run by David Turanski)
Number of retries
1

Tests

  • 953 tests in total
  • 1 test failed
  • 1 failure is new
  • 3 tests were fixed
  • 62 tests were quarantined / skipped
  • 25 minutes taken in total.
New test failures 1
Status Test Duration
Collapse Failed ModuleCommandTests testDeleteComposedModuleUsedByStream History
1 sec
java.lang.AssertionError: java.lang.AssertionError
java.lang.AssertionError
	at org.junit.Assert.fail(Assert.java:86)
	at org.junit.Assert.assertTrue(Assert.java:41)
	at org.junit.Assert.assertFalse(Assert.java:64)
	at org.junit.Assert.assertFalse(Assert.java:74)
	at org.springframework.xd.shell.command.ModuleCommandTests.testDeleteComposedModuleUsedByStream(ModuleCommandTests.java:179)
	at sun.reflect.NativeMethodAccessorImpl.invoke0(Native Method)
(60 more lines...)
Fixed tests 3
Status Test Failing since Duration
Successful ExampleProcessingChainTests processingChain History
Failing since build #86 (Code changes detected) 7 secs
Successful ExampleProcessingChainTests testProcessingChain History
Failing since build #86 (Code changes detected) 7 secs
Successful FileSourceModuleTests testFileContents History
Failing since build #87 (Code changes detected) 2 secs