Builds the 1.1.x branch using JDK8

Build: #48 failed Rebuilt by Glenn Renfro

Build result summary

Details

Completed
Duration
28 minutes
Labels
None
Revision
cac7801f3cd83b7288e748676bb5f173996606ba cac7801f3cd83b7288e748676bb5f173996606ba
Total tests
721
Fixed in
#55 (Changes by Marius Bogoevici <mbogoevici@pivotal.io>)
Number of retries
1

Tests

Responsible

No one has taken responsibility for this failure

Comments

  1. Glenn Renfro

    Failed on the Kafka Tests:  KafkaSingleNodeStreamDeploymentIntegrationTests

Code commits

Author Commit Message Commit date
David Turanski <dturanski@pivotal.io> David Turanski <dturanski@pivotal.io> cac7801f3cd83b7288e748676bb5f173996606ba cac7801f3cd83b7288e748676bb5f173996606ba XD-2791 disable testDeleteComposedModuleUsedByStream on Windows
Conflicts:
        spring-xd-shell/src/test/java/org/springframework/xd/shell/command/ModuleCommandTests.java

Tests

New test failures 1
Status Test View job Duration
Collapse Failed KafkaSingleNodeStreamDeploymentIntegrationTests testTappingWithRepeatedModulesDoesNotDuplicateMessages History
Default Job 7 secs
java.lang.AssertionError: java.lang.AssertionError: expected:<DRACARYS!> but was:<null>
java.lang.AssertionError: expected:<DRACARYS!> but was:<null>
	at org.junit.Assert.fail(Assert.java:88)
	at org.junit.Assert.failNotEquals(Assert.java:834)
	at org.junit.Assert.assertEquals(Assert.java:118)
	at org.junit.Assert.assertEquals(Assert.java:144)
	at org.springframework.xd.dirt.stream.AbstractSingleNodeStreamDeploymentIntegrationTests.tapTest(AbstractSingleNodeStreamDeploymentIntegrationTests.java:608)
	at org.springframework.xd.dirt.stream.AbstractSingleNodeStreamDeploymentIntegrationTests.testTappingWithRepeatedModulesDoesNotDuplicateMessages(AbstractSingleNodeStreamDeploymentIntegrationTests.java:299)
(47 more lines...)

Jira issues

IssueDescriptionStatus
Unknown Issue TypeXD-2791Could not obtain issue details from Jira