Builds the 1.1.x branch using JDK8

Build: #51 failed Changes by Gary Russell

Build result summary

Details

Completed
Duration
90 minutes
Labels
None
Revision
6fd600bf678422a2d6bc984820e5319554ea2bb9 6fd600bf678422a2d6bc984820e5319554ea2bb9
Total tests
721
Failing since
#48 (Rebuilt by Glenn Renfro)
Fixed in
#55 (Changes by Marius Bogoevici <[email protected]>)

Responsible

This build has been failing since #48
No one has taken responsibility

Code commits

Author Commit Message Commit date
Gary Russell Gary Russell 6fd600bf678422a2d6bc984820e5319554ea2bb9 6fd600bf678422a2d6bc984820e5319554ea2bb9 XD-3027: Bump Spring Integration/AMQP Versions
JIRA: XD-3027">https://jira.spring.io/browse/XD-3027

Also Spring Framework 4.1.6

Configuration changes

Plan configuration has changed since the last successful build. See the plan audit log for more details.

Tests

New test failures 1
Status Test View job Duration
Collapse Failed KafkaSingleNodeStreamDeploymentIntegrationTests verifyQueueChannelsRegisteredOnDemand History
Default Job 9 secs
java.lang.IndexOutOfBoundsException: java.lang.IndexOutOfBoundsException: Index: 0 Size: 0
java.lang.IndexOutOfBoundsException: Index: 0 Size: 0
	at com.gs.collections.impl.list.mutable.FastList.newIndexOutOfBoundsException(FastList.java:1078)
	at com.gs.collections.impl.list.mutable.FastList.get(FastList.java:1073)
	at org.springframework.xd.dirt.stream.KafkaSingleNodeStreamDeploymentIntegrationTests.receiveFromTopicForQueue(KafkaSingleNodeStreamDeploymentIntegrationTests.java:136)
	at org.springframework.xd.dirt.stream.KafkaSingleNodeStreamDeploymentIntegrationTests.verifyOnDemandQueues(KafkaSingleNodeStreamDeploymentIntegrationTests.java:86)
	at org.springframework.xd.dirt.stream.AbstractSingleNodeStreamDeploymentIntegrationTests.verifyQueueChannelsRegisteredOnDemand(AbstractSingleNodeStreamDeploymentIntegrationTests.java:477)
	at sun.reflect.NativeMethodAccessorImpl.invoke0(Native Method)
(46 more lines...)
Fixed tests 1
Status Test Failing since View job Duration
Successful KafkaSingleNodeStreamDeploymentIntegrationTests testBasicTap History
Failing since build #50 (Changes by Gary Russell) Default Job 6 secs

Jira issues

IssueDescriptionStatus
Unknown Issue TypeXD-3027Could not obtain issue details from Jira