Builds the 1.1.x branch using JDK8

Test results

  • 1,001 tests in total
  • 12 tests failed
  • 12 failures are new
  • 4 tests were quarantined / skipped
  • 39 minutes taken in total.
New test failures 12
Status Test View job Duration
Collapse Failed KafkaTransportSparkStreamingTests testTapSparkProcessor History
Default Job 43 secs
java.lang.IllegalArgumentException: java.lang.IllegalArgumentException: Failure.  CommandResult = CommandResult [success=false, result=null, exception=org.springframework.xd.rest.client.impl.SpringXDException: There is no stream definition named 'testTapSparkProcessor1425457654'
]
java.lang.IllegalArgumentException: Failure.  CommandResult = CommandResult [success=false, result=null, exception=org.springframework.xd.rest.client.impl.SpringXDException: There is no stream definition named 'testTapSparkProcessor1425457654'
]
	at org.springframework.util.Assert.isTrue(Assert.java:65)
	at org.springframework.xd.shell.command.AbstractCommandTemplate.executeCommand(AbstractCommandTemplate.java:51)
	at org.springframework.xd.shell.command.StreamCommandTemplate.destroyStream(StreamCommandTemplate.java:133)
	at org.springframework.xd.spark.streaming.AbstractSparkStreamingTests.testTapSparkProcessor(AbstractSparkStreamingTests.java:164)
(50 more lines...)
Collapse Failed KafkaTransportSparkStreamingTests testSparkFileLogger History
Default Job 43 secs
java.lang.AssertionError: java.lang.AssertionError
java.lang.AssertionError
	at org.junit.Assert.fail(Assert.java:86)
	at org.junit.Assert.assertTrue(Assert.java:41)
	at org.junit.Assert.assertTrue(Assert.java:52)
	at org.springframework.xd.shell.command.StreamCommandTemplate.verifyExists(StreamCommandTemplate.java:162)
	at org.springframework.xd.shell.command.StreamCommandTemplate.doCreate(StreamCommandTemplate.java:99)
	at org.springframework.xd.shell.command.StreamCommandTemplate.create(StreamCommandTemplate.java:65)
(52 more lines...)
Collapse Failed KafkaTransportSparkStreamingTests testSparkProcessorWithOutputType History
Default Job 44 secs
java.lang.AssertionError: java.lang.AssertionError
java.lang.AssertionError
	at org.junit.Assert.fail(Assert.java:86)
	at org.junit.Assert.assertTrue(Assert.java:41)
	at org.junit.Assert.assertTrue(Assert.java:52)
	at org.springframework.xd.shell.command.StreamCommandTemplate.verifyExists(StreamCommandTemplate.java:162)
	at org.springframework.xd.shell.command.StreamCommandTemplate.doCreate(StreamCommandTemplate.java:99)
	at org.springframework.xd.shell.command.StreamCommandTemplate.create(StreamCommandTemplate.java:65)
(52 more lines...)
Collapse Failed KafkaTransportSparkStreamingTests testSparkScalaProcessor History
Default Job 46 secs
java.lang.AssertionError: java.lang.AssertionError
java.lang.AssertionError
	at org.junit.Assert.fail(Assert.java:86)
	at org.junit.Assert.assertTrue(Assert.java:41)
	at org.junit.Assert.assertTrue(Assert.java:52)
	at org.springframework.xd.shell.command.StreamCommandTemplate.verifyExists(StreamCommandTemplate.java:162)
	at org.springframework.xd.shell.command.StreamCommandTemplate.doCreate(StreamCommandTemplate.java:99)
	at org.springframework.xd.shell.command.StreamCommandTemplate.create(StreamCommandTemplate.java:65)
(52 more lines...)
Collapse Failed KafkaTransportSparkStreamingTests testSparkScalaFileLoggerWithInputType History
Default Job 43 secs
java.lang.AssertionError: java.lang.AssertionError
java.lang.AssertionError
	at org.junit.Assert.fail(Assert.java:86)
	at org.junit.Assert.assertTrue(Assert.java:41)
	at org.junit.Assert.assertTrue(Assert.java:52)
	at org.springframework.xd.shell.command.StreamCommandTemplate.verifyExists(StreamCommandTemplate.java:162)
	at org.springframework.xd.shell.command.StreamCommandTemplate.doCreate(StreamCommandTemplate.java:99)
	at org.springframework.xd.shell.command.StreamCommandTemplate.create(StreamCommandTemplate.java:65)
(52 more lines...)
Collapse Failed KafkaTransportSparkStreamingTests testSparkScalaProcessorWithOutputType History
Default Job 43 secs
java.lang.AssertionError: java.lang.AssertionError
java.lang.AssertionError
	at org.junit.Assert.fail(Assert.java:86)
	at org.junit.Assert.assertTrue(Assert.java:41)
	at org.junit.Assert.assertTrue(Assert.java:52)
	at org.springframework.xd.shell.command.StreamCommandTemplate.verifyExists(StreamCommandTemplate.java:162)
	at org.springframework.xd.shell.command.StreamCommandTemplate.doCreate(StreamCommandTemplate.java:99)
	at org.springframework.xd.shell.command.StreamCommandTemplate.create(StreamCommandTemplate.java:65)
(52 more lines...)
Collapse Failed KafkaTransportSparkStreamingTests testSparkFileLoggerWithInputType History
Default Job 1 min
java.lang.AssertionError: java.lang.AssertionError
java.lang.AssertionError
	at org.junit.Assert.fail(Assert.java:86)
	at org.junit.Assert.assertTrue(Assert.java:41)
	at org.junit.Assert.assertTrue(Assert.java:52)
	at org.springframework.xd.shell.command.StreamCommandTemplate.verifyExists(StreamCommandTemplate.java:162)
	at org.springframework.xd.shell.command.StreamCommandTemplate.doCreate(StreamCommandTemplate.java:99)
	at org.springframework.xd.shell.command.StreamCommandTemplate.create(StreamCommandTemplate.java:65)
(52 more lines...)
Collapse Failed KafkaTransportSparkStreamingTests testSparkScalaFileLogger History
Default Job 44 secs
java.lang.AssertionError: java.lang.AssertionError
java.lang.AssertionError
	at org.junit.Assert.fail(Assert.java:86)
	at org.junit.Assert.assertTrue(Assert.java:41)
	at org.junit.Assert.assertTrue(Assert.java:52)
	at org.springframework.xd.shell.command.StreamCommandTemplate.verifyExists(StreamCommandTemplate.java:162)
	at org.springframework.xd.shell.command.StreamCommandTemplate.doCreate(StreamCommandTemplate.java:99)
	at org.springframework.xd.shell.command.StreamCommandTemplate.create(StreamCommandTemplate.java:65)
(52 more lines...)
Collapse Failed KafkaTransportSparkStreamingTests testSparkTapStream History
Default Job 46 secs
java.lang.AssertionError: java.lang.AssertionError
java.lang.AssertionError
	at org.junit.Assert.fail(Assert.java:86)
	at org.junit.Assert.assertTrue(Assert.java:41)
	at org.junit.Assert.assertTrue(Assert.java:52)
	at org.springframework.xd.shell.command.StreamCommandTemplate.verifyExists(StreamCommandTemplate.java:162)
	at org.springframework.xd.shell.command.StreamCommandTemplate.doCreate(StreamCommandTemplate.java:99)
	at org.springframework.xd.shell.command.StreamCommandTemplate.create(StreamCommandTemplate.java:65)
(52 more lines...)
Collapse Failed KafkaTransportSparkStreamingTests testSparkScalaProcessorWithInputType History
Default Job 44 secs
java.lang.AssertionError: java.lang.AssertionError
java.lang.AssertionError
	at org.junit.Assert.fail(Assert.java:86)
	at org.junit.Assert.assertTrue(Assert.java:41)
	at org.junit.Assert.assertTrue(Assert.java:52)
	at org.springframework.xd.shell.command.StreamCommandTemplate.verifyExists(StreamCommandTemplate.java:162)
	at org.springframework.xd.shell.command.StreamCommandTemplate.doCreate(StreamCommandTemplate.java:99)
	at org.springframework.xd.shell.command.StreamCommandTemplate.create(StreamCommandTemplate.java:65)
(52 more lines...)
Collapse Failed KafkaTransportSparkStreamingTests testSparkProcessorWithInputType History
Default Job 43 secs
java.lang.AssertionError: java.lang.AssertionError
java.lang.AssertionError
	at org.junit.Assert.fail(Assert.java:86)
	at org.junit.Assert.assertTrue(Assert.java:41)
	at org.junit.Assert.assertTrue(Assert.java:52)
	at org.springframework.xd.shell.command.StreamCommandTemplate.verifyExists(StreamCommandTemplate.java:162)
	at org.springframework.xd.shell.command.StreamCommandTemplate.doCreate(StreamCommandTemplate.java:99)
	at org.springframework.xd.shell.command.StreamCommandTemplate.create(StreamCommandTemplate.java:65)
(52 more lines...)
Collapse Failed KafkaTransportSparkStreamingTests testSparkProcessor History
Default Job 44 secs
java.lang.AssertionError: java.lang.AssertionError
java.lang.AssertionError
	at org.junit.Assert.fail(Assert.java:86)
	at org.junit.Assert.assertTrue(Assert.java:41)
	at org.junit.Assert.assertTrue(Assert.java:52)
	at org.springframework.xd.shell.command.StreamCommandTemplate.verifyExists(StreamCommandTemplate.java:162)
	at org.springframework.xd.shell.command.StreamCommandTemplate.doCreate(StreamCommandTemplate.java:99)
	at org.springframework.xd.shell.command.StreamCommandTemplate.create(StreamCommandTemplate.java:65)
(52 more lines...)
Skipped tests 4
Status Test Failing since View job
Skipped KafkaMessageBusTests testDirectBinding History
Default Job
Skipped KafkaSingleNodeStreamDeploymentIntegrationTests verifyQueueChannelsRegisteredOnDemand History
Failing since build #51 (Changes by Gary Russell <grussell@pivotal.io>) Default Job
Skipped KafkaSingleNodeStreamDeploymentIntegrationTests testTappingWithRepeatedModulesDoesNotDuplicateMessages History
Default Job
Skipped StreamCommandTests testJsonPath History
Default Job